{"text_format":"1","workbook":"xlsx","n_sheets":9,"sheets":["Front","Input_Scen","Input_Res","Input_Data","Input_Lists","Calc_TransProfile","Calc_TransProb","Calc_Matrix","Output"],"not_rendered":{"charts":0,"images":0,"macros":1,"external_links":1,"defined_names":0,"comments":1,"pivot_tables":0},"unopened":[],"bounds":{"document_bytes":16777216,"sheet_cells":100000,"rows_first":2000,"rows_last":500,"rows_between":2000,"halvings":0,"cell_chars":16384,"cell_head_chars":4096},"cells_cut":0,"cells_raw":0,"read":"whole","date_system":"1900"}

{"sheet":"Front","index":0,"n_rows":14,"n_cols":2,"rows_kept":14,"cut":false,"hidden":false,"merged":[]}
["Modelling Antibiotic Resistance"]
[]
["This workbook has been produced by the Antibiotic Resistance Working Party for the Institute and Faculty of Actuaries and is compliant with TAS 300"]
[]
["The workbook requires macros to be enabled for it to run. Cells have been locked and protected to ensure only inputs are changed, however there is no password if the user needs to explore/change the formulas"]
[]
["Purpose","The purpose of this workbook is to investigate the impact of antibiotic resistance on mortality and morbidity over time. The workbook has been designed to be simple, minimal and flexible so that users can tailor the inputs towards their own investigations, data or georgraphy. This model has been designed to capture at a very high level the interaction of varying resistance over time to both mortality and morbidity, it is not intended to fully capture the intricate dynamics that antibiotic resistance is likely to have or model pandemic type risks."]
["Users","The intended users of this workbook are members of the Institute & Faculty of Actuaries"]
["Data","The model has been pre-populated with patrameters informed by data collected by the working party. The analysis completed on the available data accompanies this model and is available to the user. Further analysis on the limitations and availability of data is considered in detail in the Sessional Research paper on Antibiotic Resistance produced by the working party and published in August 2019"]
["Assumptions","A detailed assessment of the modelling and data assumptions are contaiened within the Sessional Research paper produced by the working party and published in August 2019."]
{"$rows_left_out":5}
{"sheet":"Input_Scen","index":1,"n_rows":60,"n_cols":8,"rows_kept":60,"cut":false,"hidden":false,"merged":[]}
["Input Scenario"]
["This worksheet allows the user to input a custom resistance profile and contains the resistance profiles used within the working party study"]
[]
["Instructions"]
["The following cells are inputs -->","Inputs"]
["General inputs are not expected to be updated"]
["User inputs allow different scenarios to be run"]
["Scalar adjustments allow the user to explore varying infection / mortality rates for example to incorporate additional bacteria from available data"]
["Note that the expected number of deaths from the infection is set as proportionate to the infection rate, any mortality scalar input will be compounded with the infection rate scalar"]
["Inputs have not been restricted (except those that require look up lists), users should ensure inputs and outputs are reasonable based on their own expectations"]
{"$rows_left_out":51}
{"sheet":"Input_Res","index":2,"n_rows":47,"n_cols":39,"rows_kept":47,"cut":false,"hidden":false,"merged":[[10,11,10,17],[10,18,10,24],[10,25,10,31],[10,32,10,38],[10,4,10,10]]}
["Input Resistance Profiles"]
["This worksheet allows the user to input a custom resistance profile and contains the resistance profiles used within the working party study"]
["The \"Selected Profile\" is populated based on user inputs on 'Input_Scen' and linked through below. The selected profile is displayed in column B"]
[]
["Key","Input"]
[]
["Scenario",{"$f":"Input_Scen!B18","v":"1-14 yrs"}]
["Age Group",{"$f":"Input_Scen!B19","v":"100% Resistance by 2050"}]
["Lookup Name",{"$f":"B8&\"_\"&B7","v":"100% Resistance by 2050_1-14 yrs"},null,null,"User input resistance profile --->",null,null,null,null,null,null,"Pre-populated resistance profiles by scenario, age group and year --->"]
["Match",{"$f":"MATCH(B9,$E$13:$AM$13,0)","v":30}]
{"$rows_left_out":38}
{"sheet":"Input_Data","index":3,"n_rows":18,"n_cols":5,"rows_kept":18,"cut":false,"hidden":false,"merged":[]}
["Input Observation Data"]
["This worksheet can be used to input different observations from available data.The user can update the inputs based on their own data analysis."]
["The pre-populated data has been on data analysis from the Office for National Statistics and Public Heath England"]
[]
["Key","Input"]
[]
["Input Reference","[Input_Data_1]","[Input_Data_2]","[Input_Data_3]","[Input_Data_4]"]
[]
["Age Group","Population","Total deaths in a year (including caused by infection)","Reported Infections in a year","Deaths caused by infection in a year"]
[{"$f":"Input_Lists!A5","v":"<1 yr"},668198.5,2579,536.3125,49.5]
{"$rows_left_out":9}
{"sheet":"Input_Lists","index":4,"n_rows":18,"n_cols":1,"rows_kept":18,"cut":false,"hidden":false,"merged":[]}
["Lists"]
["This worksheet is used to define any drop down lists used in the look up tables, users are not expected to update this worksheet"]
[]
["Age Groups"]
["<1 yr"]
["1-14 yrs"]
["15-44 yrs"]
["45-64 yrs"]
["65-74 yrs"]
["75-84 yrs"]
{"$rows_left_out":9}
{"sheet":"Calc_TransProfile","index":5,"n_rows":62,"n_cols":16,"rows_kept":62,"cut":false,"hidden":false,"merged":[]}
["Calculation - Transition Profiles"]
["This worksheet calculates the transition profile over time by combining the initial observation data, resistance profiles and user input adjustments"]
[]
["User inputs from 'Input_Scen'"]
[]
[{"$f":"Input_Scen!A18","v":"Age Group"},{"$f":"Input_Scen!B18","v":"1-14 yrs"}]
[{"$f":"Input_Scen!A19","v":"Resistance Profile"},{"$f":"Input_Scen!B19","v":"100% Resistance by 2050"}]
[{"$f":"Input_Scen!A20","v":"Relative mortality rate of resistance against susceptible infection"},{"$f":"Input_Scen!B20","v":2.5}]
[{"$f":"Input_Scen!A21","v":"Average hospitalised days with susceptible infection"},{"$f":"Input_Scen!B21","v":10}]
[{"$f":"Input_Scen!A22","v":"Average hospitalised days with resistant infection"},{"$f":"Input_Scen!B22","v":12}]
{"$rows_left_out":53}
{"sheet":"Calc_TransProb","index":6,"n_rows":39,"n_cols":36,"rows_kept":39,"cut":false,"hidden":false,"merged":[[3,1,3,7],[3,9,3,11],[3,13,3,19],[3,21,3,23],[3,25,3,35]]}
["Calculation - Transition Probabilities"]
["This worksheet converts the annual observations of state transitions into daily transition probabilities"]
[]
[null,"Number of transitions in a year",null,null,null,null,null,null,null,"Holding time in state t(i)",null,null,null,"Daily Transition rates σ(i)",null,null,null,null,null,null,null,"Total daily transition rate out of state λ(i)",null,null,null,"Probability of transition from i to j given you are in state i:  Pr(X(t+1) = j | X(t) = i)"]
["Year","HS","HR","SD","RD","SH","RH","HD",null,"H","S","R",null,"HS","HR","SD","RD","SH","RH","HD",null,"H","R","S",null,"HS","HR","HH","HD","SH","SS","SD","RH","RR","RD","DD"]
[{"$f":"Calc_TransProfile!A29","v":2017},{"$f":"Calc_TransProfile!H29","v":178.74960823942891},{"$f":"Calc_TransProfile!G29","v":23.312891760571102},{"$f":"Calc_TransProfile!I29","v":5.8915347755369627},{"$f":"Calc_TransProfile!J29","v":1.9209652244630364},{"$f":"B6-D6","v":172.85807346389194},{"$f":"C6-E6","v":21.391926536108066},{"$f":"Calc_TransProfile!L29","v":935.1875},null,{"$f":"Calc_TransProfile!P29","v":3312385981.4992166},{"$f":"Calc_TransProfile!M29","v":1787.496082394289},{"$f":"Calc_TransProfile!N29","v":279.75470112685321},null,{"$f":"B6/J6","v":5.3964003361264433E-8},{"$f":"C6/J6","v":7.0380963724582216E-9},{"$f":"D6/K6","v":3.2959707344619497E-3},{"$f":"E6/L6","v":6.8666056967957275E-3},{"$f":"F6/K6","v":9.6704029265538047E-2},{"$f":"G6/L6","v":7.6466727636537613E-2},{"$f":"H6/J6","v":2.8233047272369069E-7},null,{"$f":"N6+O6+T6","v":3.4333257245741336E-7},{"$f":"Q6+S6","v":8.3333333333333343E-2},{"$f":"P6+R6","v":9.9999999999999992E-2},null,{"$f":"(1-AB6)*N6/V6","v":5.3963994099300873E-8},{"$f":"(1-AB6)*O6/V6","v":7.0380951644938732E-9},{"$f":"EXP(-V6)","v":0.99999965666748647},{"$f":"(1-AB6)*T6/V6","v":2.8233042426667511E-7},{"$f":"(1-AE6)*R6/X6","v":9.202605111234724E-2},{"$f":"EXP(-X6)","v":0.90483741803595963},{"$f":"(1-AE6)*P6/X6","v":3.1365308516931364E-3},{"$f":"(1-AH6)*S6/W6","v":7.3367303634713596E-2},{"$f":"EXP(-W6)","v":0.92004441462932329},{"$f":"(1-AH6)*Q6/W6","v":6.5882817359631096E-3},1]
[{"$f":"Calc_TransProfile!A30","v":2018},{"$f":"Calc_TransProfile!H30","v":173.31747227044914},{"$f":"Calc_TransProfile!G30","v":28.745027729550849},{"$f":"Calc_TransProfile!I30","v":5.7124931637432086},{"$f":"Calc_TransProfile!J30","v":2.3685692539474203},{"$f":"B7-D7","v":167.60497910670594},{"$f":"C7-E7","v":26.376458475603428},{"$f":"Calc_TransProfile!L30","v":935.1875},null,{"$f":"Calc_TransProfile!P30","v":3312385921.622303},{"$f":"Calc_TransProfile!M30","v":1733.1747227044914},{"$f":"Calc_TransProfile!N30","v":344.94033275461015},null,{"$f":"B7/J7","v":5.232405775519166E-8},{"$f":"C7/J7","v":8.6780430812459301E-9},3.2959707344619497E-3,6.8666056967957283E-3,{"$f":"F7/K7","v":9.6704029265538061E-2},7.6466727636537613E-2,{"$f":"H7/J7","v":2.8233047782728601E-7},null,{"$f":"N7+O7+T7","v":3.4333257866372361E-7},{"$f":"Q7+S7","v":8.3333333333333343E-2},{"$f":"P7+R7","v":0.1},null,{"$f":"(1-AB7)*N7/V7","v":5.2324048776362885E-8},{"$f":"(1-AB7)*O7/V7","v":8.6780415920903435E-9},{"$f":"EXP(-V7)","v":0.99999965666748025},{"$f":"(1-AB7)*T7/V7","v":2.823304293792656E-7},{"$f":"(1-AE7)*R7/X7","v":9.2026051112347351E-2},{"$f":"EXP(-X7)","v":0.90483741803595952},{"$f":"(1-AE7)*P7/X7","v":3.1365308516931398E-3},{"$f":"(1-AH7)*S7/W7","v":7.3367303634713596E-2},{"$f":"EXP(-W7)","v":0.92004441462932329},{"$f":"(1-AH7)*Q7/W7","v":6.5882817359631096E-3},1]
[{"$f":"Calc_TransProfile!A31","v":2019},{"$f":"Calc_TransProfile!H31","v":167.88533630146941},{"$f":"Calc_TransProfile!G31","v":34.177163698530585},{"$f":"Calc_TransProfile!I31","v":5.5334515519494554},{"$f":"Calc_TransProfile!J31","v":2.816173283431803},162.35188474951994,31.360990415098783,{"$f":"Calc_TransProfile!L31","v":935.1875},null,{"$f":"Calc_TransProfile!P31","v":3312385861.7453904},{"$f":"Calc_TransProfile!M31","v":1678.853363014694},{"$f":"Calc_TransProfile!N31","v":410.12596438236699},null,5.0684112089829368E-8,1.031798984932319E-8,3.2959707344619497E-3,6.8666056967957283E-3,9.6704029265538047E-2,7.6466727636537613E-2,2.8233048293088144E-7,null,3.4333258487003402E-7,8.3333333333333343E-2,9.9999999999999992E-2,null,5.0684103394030855E-8,1.0317988079080858E-8,0.99999965666747404,2.8233043449185605E-7,9.202605111234724E-2,0.90483741803595963,3.1365308516931364E-3,7.3367303634713596E-2,0.92004441462932329,6.5882817359631096E-3,1]
[{"$f":"Calc_TransProfile!A32","v":2020},{"$f":"Calc_TransProfile!H32","v":162.45320033248967},{"$f":"Calc_TransProfile!G32","v":39.609299667510328},{"$f":"Calc_TransProfile!I32","v":5.3544099401557022},{"$f":"Calc_TransProfile!J32","v":3.2637773129161864},157.09879039233397,36.345522354594138,{"$f":"Calc_TransProfile!L32","v":935.1875},null,{"$f":"Calc_TransProfile!P32","v":3312385801.8684769},{"$f":"Calc_TransProfile!M32","v":1624.5320033248968},{"$f":"Calc_TransProfile!N32","v":475.31159601012394},null,4.9044166365177568E-8,1.1957936676690016E-8,3.2959707344619497E-3,6.8666056967957275E-3,9.6704029265538047E-2,7.6466727636537599E-2,2.8233048803447714E-7,null,3.4333259107634469E-7,8.3333333333333329E-2,9.9999999999999992E-2,null,4.9044157952304789E-8,1.1957934625465426E-8,0.99999965666746782,2.8233043960444654E-7,9.202605111234724E-2,0.90483741803595963,3.1365308516931364E-3,7.3367303634713596E-2,0.92004441462932329,6.5882817359631104E-3,1]
[{"$f":"Calc_TransProfile!A33","v":2021},{"$f":"Calc_TransProfile!H33","v":157.02106436350994},{"$f":"Calc_TransProfile!G33","v":45.041435636490078},{"$f":"Calc_TransProfile!I33","v":5.1753683283619489},{"$f":"Calc_TransProfile!J33","v":3.7113813424005704},151.84569603514799,41.330054294089507,{"$f":"Calc_TransProfile!L33","v":935.1875},null,{"$f":"Calc_TransProfile!P33","v":3312385741.9915638},{"$f":"Calc_TransProfile!M33","v":1570.2106436350994},{"$f":"Calc_TransProfile!N33","v":540.497227637881},null,4.7404220581236235E-8,1.3597883563346407E-8,3.2959707344619497E-3,6.8666056967957266E-3,9.6704029265538061E-2,7.6466727636537599E-2,2.8233049313807299E-7,null,3.4333259728265562E-7,8.3333333333333329E-2,0.1,null,4.7404212451184653E-8,1.3597881231244045E-8,0.9999996566674616,2.8233044471703693E-7,9.2026051112347351E-2,0.90483741803595952,3.1365308516931398E-3,7.3367303634713596E-2,0.92004441462932329,6.5882817359631087E-3,1]
{"$rows_left_out":30}
{"sheet":"Calc_Matrix","index":7,"n_rows":312,"n_cols":13,"rows_kept":312,"cut":false,"hidden":false,"merged":[[5,0,5,5],[5,7,5,12]]}
["Matrix Calculations"]
["This worksheet calculates the 1 year transition matrix based on the user inputs and data "]
[]
[{"$f":"Input_Scen!A14","v":"Days in a year"},{"$f":"Input_Scen!B14","v":365}]
[]
["Daily Transition Probability Matrix in Year X",null,null,null,null,null,null,"Transition Probability Matrix For Year X"]
[]
["Year",{"$f":"Input_Scen!B13","v":2017},null,null,null,null,null,null,"Qx",{"$f":"L12","v":1.0388009505209066E-4},"Pr(D[365] | H[0] )"]
["Match Year",{"$f":"MATCH(B8,[1]TransProb!$A$12:$A$45)","v":1}]
[]
{"$rows_left_out":303}
{"sheet":"Output","index":8,"n_rows":47,"n_cols":7,"rows_kept":47,"cut":false,"hidden":false,"merged":[]}
["Output Results"]
["This worksheet reproduces the projected number of infections, deaths and days spent in hospital with the infection alongside the matrix results on the variance to qx"]
[]
["Scenario Inputs"]
[{"$f":"Input_Scen!A18","v":"Age Group"},{"$f":"Input_Scen!B18","v":"1-14 yrs"}]
[{"$f":"Input_Scen!A19","v":"Resistance Profile"},{"$f":"Input_Scen!B19","v":"100% Resistance by 2050"}]
[{"$f":"Input_Scen!A20","v":"Relative mortality rate of resistance against susceptible infection"},{"$f":"Input_Scen!B20","v":2.5}]
[{"$f":"Input_Scen!A21","v":"Average hospitalised days with susceptible infection"},{"$f":"Input_Scen!B21","v":10}]
[{"$f":"Input_Scen!A22","v":"Average hospitalised days with resistant infection"},{"$f":"Input_Scen!B22","v":12}]
[]
{"$rows_left_out":37}