{"text_format":"1","workbook":"xlsx","n_sheets":7,"sheets":["Rawdata","Parameters","Wine production","Chart profit","Target price","Wine production Alt","Results"],"not_rendered":{"charts":4,"images":0,"macros":1,"external_links":0,"defined_names":20,"comments":0,"pivot_tables":0},"unopened":[],"bounds":{"document_bytes":16777216,"sheet_cells":100000,"rows_first":2000,"rows_last":500,"rows_between":2000,"halvings":0,"cell_chars":16384,"cell_head_chars":4096},"cells_cut":0,"cells_raw":0,"read":"whole","date_system":"1900"}

{"sheet":"Rawdata","index":0,"n_rows":100,"n_cols":107,"rows_kept":100,"cut":false,"hidden":false,"merged":[]}
[0.56443202005077897,0.69920237529101426,0.89870567564708204,0.93122240601146999,0.97415243446479927,0.11955182990610858,0.59561580545317983,0.5934852785535728,0.86187385261812721,0.93861673546830804,0.57809518940692883,0.96415477008167705,0.6792376247284303,0.22365378112539591,0.87356342397126363,0.63617327819502134,0.90087494252434897,0.72793456152024694,2.9894812643903035E-2,0.8044560939693578,0.32057642111672946,0.79669917416567437,0.54638557873843785,0.49220840446054348,0.89260018589869039,0.17468057679613014,0.57749514222779186,0.2855456344289915,0.16320459609758275,0.50139583233483076,0.60739802448072666,0.87602276390594092,0.45114927536271676,0.84141678681651266,0.17432724028530622,0.39414201695069151,0.92683808742356355,0.31222707765426794,0.29633301197567508,0.4076585720558894,0.47612298622533222,0.43214391928187146,0.12136055810209134,0.70948751937985566,0.67108643074590524,0.14939360360635789,0.80134893689951048,7.1081856298094159E-2,0.26270824267506598,0.39157890482409963,4.5781893972890897E-2,0.14687233792791099,0.32318603815154534,0.97367011082252031,0.62222826004794862,0.75772468182063379,0.42239740958742145,0.78770067515756537,0.67605812596803616,0.55461076816345067,4.7103717780395349E-2,0.97000684346862542,0.17007897335006972,0.2497648275368346,0.58927826963738084,0.13583567925990281,5.5602713576789697E-2,0.72988810919529434,0.95628766119686959,0.35039946220395679,0.87124365886642874,0.83273721976356707,0.93113220825288701,0.2468305225791867,0.59637061068417652,0.71450920589496991,6.2073623675096279E-2,0.9565356926694274,0.33298083529236244,0.12407881578414681,0.97051737160870211,0.38514586070455814,0.97996584037027945,0.15093263927299483,5.6990014411118506E-2,0.21502567377991633,0.66081024632482099,0.86507602877894518,0.85280235771540125,8.666974495886226E-2,0.23390103068018731,0.96741862924140221,0.31961510269899207,0.82416319376295344,0.60507453189484328,0.9285325924912522,0.22133557166383144,0.9759807078575754,0.66625064228971065,0.61098209002644244,null,"Count",null,null,"Expected",null,"Check"]
[0.36727809214240814,0.63010326708560216,0.28835837432358302,0.6931257701296667,0.87907629221059469,0.87434721955136219,0.38355752783167185,0.9270010689987781,0.25683735098958971,0.56350154522171347,0.73247015030798746,4.7372373720043437E-2,0.10545119219306998,0.67163812254297994,0.31160149282335869,0.25009157289266348,0.26821548968166986,0.71923475680896076,0.97143353625061446,0.99029512925816443,0.56268772673076128,0.29281556385313479,0.39844732023645291,0.26785405672264218,0.13321551403250775,0.75730746934923121,0.54312871884385361,0.54262505198415745,0.35071116463554108,0.81128772532704074,0.43836805144083024,0.83335619522037108,0.65423759684949545,0.26750823674607771,0.3681599601993869,0.35988550067478986,0.61764614574947441,0.97152691021541626,0.77180335407891487,0.84540875933940507,0.54577710509460431,0.572599719900029,0.30436084419972809,0.64399593795288723,0.90349775011298317,0.89687339948308009,9.2490471472966629E-2,0.56767516613683655,0.88654523939312935,0.64617839573143177,0.58148719640799684,0.36343020139473181,0.99659049912362407,0.34907812355543777,0.75632321212386044,0.39486454867008536,0.71725993001962862,0.54835274285273472,0.37305159954263323,0.62655017645511946,0.26100238673193643,0.54995869784071594,2.5428139806937256E-2,7.2974629654353751E-2,0.84499652625392785,0.8855372005596801,6.6015776671643045E-2,0.88245721922135889,0.1771678940627246,0.3120350946985424,0.36128866448664732,1.5533173421864999E-2,7.1476131895318096E-2,0.12353652011216276,5.4940874690716512E-3,0.20222623321731792,0.31061951934864684,0.26496019922523983,9.1731322464246756E-2,0.94986556250268084,0.16872782609627712,0.1368813227101493,0.51436045015246656,0.99547362468860834,9.6410789189541046E-2,0.36154585897689484,0.39035331319882405,0.31773431316775158,0.18201085990778854,0.71757989075075024,0.61284779431260017,0.92255728473251952,0.42020412187143741,9.7744062822407662E-2,0.6660275024163006,0.95534705767908201,0.10792844128493007,0.24888829553710545,0.77241595727741752,0.22898785476223105,null,"Total",{"$f":"COUNT(A1:CV100)","v":10000},null,10000,null,{"$f":"IF(CY2=DA2,\"OK\",\"CHECKDATA\")","v":"OK"}]
[0.82249022287598339,0.1792538782904104,0.94062340097205999,0.96528930362178367,0.94680558711742946,0.65223461408990113,0.78194620712324037,4.9635591964743986E-2,0.29163170700842944,0.13944403145941831,0.90725225377633312,0.86905494249389381,0.26555762301958941,0.67991411361841769,5.0883332674183102E-3,0.27341014098444039,0.9728586793409908,0.38326010419904899,0.7862079340569248,5.5277417696362741E-2,4.1498875123449741E-2,6.5090048580926041E-2,0.28886320355406869,0.37418570587192701,8.0896199930270085E-2,0.32959592817730332,0.68083982977970747,6.6302389965453346E-2,0.24179613003450395,0.29515746723175718,0.24263934096674877,0.95409766137458796,0.84507272383302023,4.5914274277200628E-2,0.21315773074917366,0.49237453297906164,0.36706877805240545,0.32850252399006064,0.9035503651457879,0.26347231732243903,0.17603608635244106,0.10262139660354286,0.28279568588079973,0.62152820217114524,0.22607977017513148,0.54617319351822224,0.98099255511168693,0.46768209886578083,0.59477146719466589,0.79733282379740034,0.97802965741137093,0.15386683741867091,4.8827837495619697E-3,0.28373802185048247,0.96316094587758261,0.3856822382262689,0.59716282068222215,8.5565740929397061E-2,0.62305905832604014,0.61287462557323746,0.65093510273089206,0.81292833753205418,0.55734439392490764,0.57961459669543935,0.61847160062831386,0.22410966668359344,0.19548483742328315,0.53849475867397978,0.21392974291361455,0.2282428302888897,0.94401074168726595,0.65730572145690347,9.6850883311742963E-2,0.22165199353204168,0.6578286592367899,0.93182434266005665,0.29253045222603424,0.21629315486700151,0.46891256071475895,0.82494768997742385,0.79188354912606607,0.52583463291669552,0.25684639921786012,0.7078917637266624,0.27077486966401154,0.17198823592901979,0.75679953930436517,0.18683230620145441,0.61209837030518843,0.56411772416181161,0.94668585076895684,0.52709578132934276,0.67569685574228833,0.64314389439715947,0.41744816114266181,0.65834010027798329,6.4914669782938916E-2,0.47693220669096603,0.97621805447414034,0.37464496651835555,null,"<0",{"$f":"COUNTIF(A1:CV100,\"<0\")","v":0},null,0,null,{"$f":"IF(CY3=DA3,\"OK\",\"CHECKDATA\")","v":"OK"}]
[0.26050964107810248,0.69031710045261807,0.69511702051382862,0.32357408259885556,0.81698577399627736,0.80722602795662968,0.25942170379803331,0.22127487992006167,0.66334313520730293,0.3024642545439763,0.63270470581183835,0.15495607958787172,0.31149835704740103,0.17159279499106894,0.21420832461842665,0.47465592827366621,1.2001454349534924E-2,0.32659194332582897,0.92117556427835745,5.2389369868360847E-3,0.53055364298048924,2.6436518749707205E-2,0.78676203613154527,0.61382443702492606,0.50930000167878442,0.21918192221950261,0.83757583935865332,0.78919693008549918,0.62998278436506305,0.53936433014622931,0.87643426975564176,0.33491000741990984,0.83527110714683828,0.43007606510693275,0.91293550516509725,0.71037827036579371,0.45000317346513097,0.74962188649043304,0.8483752863701175,0.33174302050976279,0.61106862991319177,7.9889212366292206E-2,0.95564487228898332,0.25780792231090865,0.9726745181135088,0.53298862649019396,7.3095101924655292E-2,0.21097637303178274,0.26853353934230617,2.4071532908382154E-2,0.52527055043385151,0.32854057336743814,0.84136455656533804,0.48020146450942713,0.362847255244788,0.20179867109133265,0.75161499217485372,0.84594714484258071,0.49018742143481298,0.1864287825795633,0.50348686524794817,0.27359344604444757,0.32330103650352993,0.46583883845851393,0.26373342080922391,0.76195637201823085,0.79176314358304778,0.47563961555178602,0.52173810864790415,0.11339237606563102,0.48103588985462353,0.3652836543749588,0.29960461841138986,4.768660238793998E-2,0.82278794173426517,0.80381344136120825,0.85391738977455034,0.93933650537565283,0.1406508949972648,0.56748323563182845,0.19003551506609762,0.70775170914445573,0.76239057387042775,0.92596120537759052,0.68278743435017408,0.61881922452486726,0.95619031579445291,4.4796690847337395E-3,0.16868178990434468,0.16759085223685888,0.54036330611827621,0.12198200999173425,0.27127742652395037,0.66730896744031887,0.77929514302941383,0.36276071122701814,0.93673152137710169,0.11090450502839488,8.2311677836084396E-2,0.88970118415920141,null,">1",{"$f":"COUNTIF(A1:CV100,\">1\")","v":0},null,0,null,{"$f":"IF(CY4=DA4,\"OK\",\"CHECKDATA\")","v":"OK"}]
[0.8712260992773424,0.74695558603494483,0.43902352353363028,0.44861353190409059,0.85936721752708589,0.19808797438874814,0.52712349934893377,0.96841465190065812,0.85614476790200011,1.4020656913376284E-2,0.38648886223569379,0.4690085729346869,0.53858625938986338,0.8263339695510199,0.65973235611084224,0.94884388079836735,5.1283671141056253E-2,0.43785783121691524,0.30226810260276693,0.3736073725448259,0.56118667706845027,0.86689710121423424,3.481611781029903E-2,0.67634396920815587,0.41241827920170715,5.2581671633895932E-2,0.7460569173048065,0.92491284180115962,0.55088982169422562,0.61324451895344123,0.84928034090329063,0.61451091240719813,0.19508443700980949,0.15350206497935326,5.8052466468736519E-2,0.28822096769745165,0.43905059336289698,0.98789715007400147,0.65901908657763442,0.93292562352541852,0.53208147767972536,0.12004851985747322,0.64386386828471098,0.56522800977337351,3.6188383326643314E-2,0.52329078480880054,0.99947944002336875,0.92614689109524095,5.0557442854201495E-2,0.41375297767732833,0.15225687268267118,0.76857048570778785,0.97541153753312626,0.35571806034946785,0.44643125129068884,0.37484005622333583,0.23140772568306767,0.72248157437319616,0.21996579999624533,0.2347091349234296,0.45986181734159781,0.12958475581968565,0.77960477986655075,0.46202613428842887,0.35034156600198518,0.15306930502800076,0.51830013465043434,0.70821362411129751,0.96125309364828537,0.92311876532446691,0.48177578832726831,0.85122647058187151,0.1777280855067267,0.75340307834601461,0.29084605937520691,0.94530316198356146,0.23082837408987933,3.8502690406640672E-2,0.14644716602686159,4.4226542481662912E-2,0.61619864426540383,0.14731818839961019,0.50261147483322843,0.94836125265772797,9.2816366969192821E-2,0.9807862331556404,0.22869389367964632,0.95631472520053584,0.38750104163424703,0.50350187280839609,0.62256437725492375,0.37713467309004389,0.76245246916136744,0.27263109485826287,0.85493661679643884,0.52051997304282782,0.99550207969914495,0.14865953962747225,0.89732251088914095,0.77217127065915603,null,null,null,null,"Expected","Tolerance","Check"]
[0.62463925289029609,0.52042569229471902,0.54008950713057002,0.9650474601277963,0.83421178599868473,0.95986045409056275,0.7762109978451005,0.51794945878572607,8.5892940086491953E-2,0.15468778349810919,0.43475005667272626,0.27563024017823268,1.3377721850893476E-2,0.4803025503662719,0.93665988759023788,5.5606385917199685E-2,0.35556755439099474,0.92092825134442102,0.97589355645065567,0.42072087710223038,0.80199794963355098,0.65420804493011808,0.51360512415907056,0.61300386528819029,0.66617265211078336,0.35175758189326378,0.10440947249396215,0.971547484690785,0.27029161847057626,0.22491780559031505,0.38506521977295816,0.35816634090431998,0.25046855884135666,0.88588144030014515,0.10566718568201583,4.9243496661466324E-2,0.75303386531682659,0.25359492973123332,0.17607185303438133,0.95307944959274526,0.45464845202116688,0.56160386100973014,0.33068310546230573,0.63403917579320479,0.77638294761603976,0.53652280396984398,0.81341861166681628,0.61613717650475941,0.6296790050634038,0.33500636858392319,0.81458662328819609,2.3811661538491791E-2,0.70734456335676321,0.93159038443485886,0.27152998464483291,0.38827169251164317,0.47095420084760231,0.10460618956041989,0.43397945893553602,0.30052545304377964,0.71146222719847174,0.12724680213346462,0.30051071103177018,0.28732168632005328,0.39437033505440955,0.59695967842037256,0.43213560381714855,0.9922615526763553,0.87588226641387612,0.51914559878873112,0.79956878833451128,0.42222492761769415,0.64207623054188856,0.80557869894627487,0.76560783069232174,7.7444849627490431E-2,0.86045145930271105,0.8492887507357505,0.43729914968312966,0.84005486608378988,0.63579808451919717,0.16838097554542708,0.69783024493619161,0.64668609266174315,0.6035039748878005,7.9359943422824375E-2,0.29751093849663168,0.43670288680507052,0.89938000754759639,0.40800423553565779,0.24707182390910376,0.12735983139331208,0.32625466101256306,5.9228076798527263E-2,0.15186733889597559,6.5991333515528106E-2,0.38116395001274117,0.86543195618842439,0.80376874976573243,0.55501455041729808,null,"Mean",{"$f":"AVERAGE(A1:CV100)","v":0.49838163164733507},null,0.5,0.01,{"$f":"IF(ABS(CY6-DA6)<DB6,\"OK\",\"CHECKDATA\")","v":"OK"}]
{"$rows_left_out":95}
{"sheet":"Parameters","index":1,"n_rows":39,"n_cols":5,"rows_kept":39,"cut":false,"hidden":false,"merged":[]}
["All scenarios"]
[]
["a",10000,"Var_a",null,"=a*exp(bx+c)"]
["b",5.4000000000000003E-3,"Var_b"]
["c",2.37,"Var_c"]
[]
{"$rows_left_out":34}
{"sheet":"Wine production","index":2,"n_rows":107,"n_cols":17,"rows_kept":107,"cut":false,"hidden":false,"merged":[[9,10,10,12]]}
["Wine production - vineyard 1"]
[]
["Simulation","Total hours of sun","Grape production","Wine bottles produced","Production costs","Total costs","Total Revenue","Profit/(loss)","Rank",null,"Profit Statistics"]
[1,{"$f":"SUM(Rawdata!A1:CV1)*Max_sunhours_base","v":654.35607690800362},{"$f":"Var_a*EXP(Var_b*'Wine production'!B4+Var_c)","v":3663256.9520459962},{"$f":"ROUNDDOWN(C4*(1-Spoilage)/Grapes_per_bottle,0)","v":4395},{"$f":"D4*Prodcosts_per_bottle","v":8790},{"$f":"E4+Vineyard_cost_base","v":28790},{"$f":"D4*Price_per_bottle","v":43950},{"$f":"G4-F4","v":15160},{"$f":"RANK(H4,$H$4:$H$103,1)","v":95}]
[{"$f":"A4+1","v":2},{"$f":"SUM(Rawdata!A2:CV2)*Max_sunhours_base","v":586.49142249597139},{"$f":"Var_a*EXP(Var_b*'Wine production'!B5+Var_c)","v":2539287.4127031821},3047,6094,26094,30470,{"$f":"G5-F5","v":4376},{"$f":"RANK(H5,$H$4:$H$103,1)","v":38},null,"Average expected profit",null,{"$f":"AVERAGE($H$4:$H$103)","v":6481.84},null,"Theoretical expected profit"]
[{"$f":"A5+1","v":3},{"$f":"SUM(Rawdata!A3:CV3)*Max_sunhours_base","v":577.31097746970283},{"$f":"Var_a*EXP(Var_b*'Wine production'!B6+Var_c)","v":2416473.1287788786},2899,5798,25798,28990,3192,30,null,"Maximum profit",null,{"$f":"MAX($H$4:$H$103)","v":23288},null,null,"Total hours of sun",{"$f":"Max_sunhours_base/2*100","v":600}]
{"$rows_left_out":102}
{"sheet":"Chart profit","index":3,"n_rows":104,"n_cols":3,"rows_kept":104,"cut":false,"hidden":false,"merged":[]}
["This tab is used to produce a chart showing the distribution of profit"]
[]
[]
["Rank","Simulation","Profit/(loss)"]
[1,{"$f":"MATCH(A5,'Wine production'!I4:I103,0)","v":68},{"$f":"OFFSET('Wine production'!$H$4,'Chart profit'!B5-1,0)","v":-3096}]
[2,48,{"$f":"OFFSET('Wine production'!$H$4,'Chart profit'!B6-1,0)","v":-2312}]
{"$rows_left_out":99}
{"sheet":"Target price","index":4,"n_rows":107,"n_cols":16,"rows_kept":107,"cut":false,"hidden":false,"merged":[]}
[]
["Year"]
["Simulation","Total hours of sun","Grape production","Wine bottles produced","Production costs","Total costs","Total Revenue","Profit/(loss)",null,"Profit Statistics"]
[1,{"$f":"SUM(Rawdata!A1:CV1)*Parameters!$B$17","v":654.35607690800362},{"$f":"Var_a*EXP(Var_b*'Target price'!B4+Var_c)","v":3663256.9520459962},{"$f":"ROUNDDOWN(C4*(1-Spoilage)/Grapes_per_bottle,0)","v":4395},{"$f":"D4*Prodcosts_per_bottle","v":8790},{"$f":"E4+Vineyard_cost_base","v":28790},{"$f":"D4*Target_price_per_bottle","v":50389.621391386638},{"$f":"G4-F4","v":21599.621391386638}]
[{"$f":"A4+1","v":2},{"$f":"SUM(Rawdata!A2:CV2)*Parameters!$B$17","v":586.49142249597139},{"$f":"Var_a*EXP(Var_b*'Target price'!B5+Var_c)","v":2539287.4127031821},3047,6094,26094,34934.511121628006,{"$f":"G5-F5","v":8840.5111216280056},null,"Average expected profit",null,{"$f":"AVERAGE($H$4:$H$103)","v":11332.039753904386},null,"Theoretical expected profit"]
[{"$f":"A5+1","v":3},{"$f":"SUM(Rawdata!A3:CV3)*Parameters!$B$17","v":577.31097746970283},{"$f":"Var_a*EXP(Var_b*'Target price'!B6+Var_c)","v":2416473.1287788786},2899,5798,25798,33237.659252247977,7439.6592522479768,null,"Maximum profit",null,{"$f":"MAX($H$4:$H$103)","v":31216.280170373859},null,null,"Total hours of sun",{"$f":"Max_sunhours_base/2*100","v":600}]
{"$rows_left_out":102}
{"sheet":"Wine production Alt","index":5,"n_rows":107,"n_cols":28,"rows_kept":107,"cut":false,"hidden":false,"merged":[[1,2,1,11],[9,21,10,23],[13,27,17,29]]}
[null,null,{"$f":"SUMIF(C4:L4,\">\"&Overtime_limit_alt,C4:L4)-COUNTIF(C4:L4,\">\"&Overtime_limit_alt)*Overtime_limit_alt","v":31.176035813462704}]
["Year",null,"Daily hours of sunshine over harvesting period"]
["Simulation","Total hours of sun","Day 1","Day 2","Day 3","Day 4","Day 5","Day 6","Day 7","Day 8","Day 9","Day 10","Grape production","Wine bottles produced","Production costs","Overtime costs","Total costs","Total Revenue","Profit/(loss)","Rank",null,"Profit Statistics"]
[1,{"$f":"SUM(Rawdata!A1:CL1)*Max_sunhours_alt","v":722.64628474589688},{"$f":"Rawdata!CM1*Max_sunhours_alt","v":3.5085154602028097},{"$f":"Rawdata!CN1*Max_sunhours_alt","v":14.511279438621033},{"$f":"Rawdata!CO1*Max_sunhours_alt","v":4.7942265404848809},{"$f":"Rawdata!CP1*Max_sunhours_alt","v":12.362447906444302},{"$f":"Rawdata!CQ1*Max_sunhours_alt","v":9.0761179784226496},{"$f":"Rawdata!CR1*Max_sunhours_alt","v":13.927988887368784},{"$f":"Rawdata!CS1*Max_sunhours_alt","v":3.3200335749574714},{"$f":"Rawdata!CT1*Max_sunhours_alt","v":14.639710617863631},{"$f":"Rawdata!CU1*Max_sunhours_alt","v":9.9937596343456594},{"$f":"Rawdata!CV1*Max_sunhours_alt","v":9.1647313503966359},{"$f":"Var_a*EXP(Var_b*'Wine production Alt'!B4+Var_c)","v":5296889.4478764562},{"$f":"ROUNDDOWN(M4*(1-Spoilage)/Grapes_per_bottle,0)","v":6356},{"$f":"N4*Prodcosts_per_bottle","v":12712},{"$f":"(SUMIF(C4:L4,\">\"&Overtime_limit_alt,C4:L4)-COUNTIF(C4:L4,\">\"&Overtime_limit_alt)*Overtime_limit_alt)\n*Number_worker_alt*Overtime_hourly_rate_alt","v":3117.6035813462704},{"$f":"O4+P4+Vineyard_cost_alt","v":40829.603581346266},{"$f":"N4*Price_per_bottle","v":63560},{"$f":"R4-Q4","v":22730.396418653734},{"$f":"RANK(S4,$S$4:$S$103,1)","v":84}]
[{"$f":"A4+1","v":2},{"$f":"SUM(Rawdata!A2:CL2)*Max_sunhours_alt","v":657.62005252952372},{"$f":"Rawdata!CM2*Max_sunhours_alt","v":9.1927169146890026},{"$f":"Rawdata!CN2*Max_sunhours_alt","v":13.838359270987793},{"$f":"Rawdata!CO2*Max_sunhours_alt","v":6.3030618280715611},{"$f":"Rawdata!CP2*Max_sunhours_alt","v":1.4661609423361148},{"$f":"Rawdata!CQ2*Max_sunhours_alt","v":9.9904125362445093},{"$f":"Rawdata!CR2*Max_sunhours_alt","v":14.33020586518623},{"$f":"Rawdata!CS2*Max_sunhours_alt","v":1.6189266192739509},{"$f":"Rawdata!CT2*Max_sunhours_alt","v":3.7333244330565818},{"$f":"Rawdata!CU2*Max_sunhours_alt","v":11.586239359161263},{"$f":"Rawdata!CV2*Max_sunhours_alt","v":3.4348178214334659},{"$f":"Var_a*EXP(Var_b*'Wine production Alt'!B5+Var_c)","v":3728395.9377854094},4474,8948,{"$f":"(SUMIF(C5:L5,\">\"&Overtime_limit_alt,C5:L5)-COUNTIF(C5:L5,\">\"&Overtime_limit_alt)*Overtime_limit_alt)\n*Number_worker_alt*Overtime_hourly_rate_alt","v":2143.7933946268795},36091.793394626875,44740,{"$f":"R5-Q5","v":8648.2066053731251},{"$f":"RANK(S5,$S$4:$S$103,1)","v":39},null,"Average expected profit",null,{"$f":"AVERAGE($S$4:$S$103)","v":13133.016969142724},null,"Theoretical expected profit"]
[{"$f":"A5+1","v":3},{"$f":"SUM(Rawdata!A3:CL3)*Max_sunhours_alt","v":635.22191372025668},{"$f":"Rawdata!CM3*Max_sunhours_alt","v":14.200287761534353},{"$f":"Rawdata!CN3*Max_sunhours_alt","v":7.9064367199401415},{"$f":"Rawdata!CO3*Max_sunhours_alt","v":10.135452836134325},{"$f":"Rawdata!CP3*Max_sunhours_alt","v":9.6471584159573922},{"$f":"Rawdata!CQ3*Max_sunhours_alt","v":6.2617224171399268},{"$f":"Rawdata!CR3*Max_sunhours_alt","v":9.8751015041697485},{"$f":"Rawdata!CS3*Max_sunhours_alt","v":0.97372004674408374},{"$f":"Rawdata!CT3*Max_sunhours_alt","v":7.1539831003644903},{"$f":"Rawdata!CU3*Max_sunhours_alt","v":14.643270817112105},{"$f":"Rawdata!CV3*Max_sunhours_alt","v":5.6196744977753337},{"$f":"Var_a*EXP(Var_b*'Wine production Alt'!B6+Var_c)","v":3303650.760689172},3964,7928,2140.7708054848072,35068.770805484804,39640,4571.2291945151956,23,null,"Maximum profit",null,{"$f":"MAX($S$4:$S$103)","v":40640.869290191215},null,null,"Total hours of sun",{"$f":"Max_sunhours_alt/2*Growing_days_alt","v":675}]
{"$rows_left_out":102}
{"sheet":"Results","index":6,"n_rows":24,"n_cols":6,"rows_kept":24,"cut":false,"hidden":false,"merged":[]}
["Summary of results"]
[]
["Statistics for both scenarios"]
[]
[null,null,null,"Base","Alternative"]
[]
{"$rows_left_out":18}