{"text_format":"1","workbook":"xlsx","n_sheets":7,"sheets":["Rawdata","Parameters","Wine production","Chart profit","Target price","Wine production Alt","Results"],"not_rendered":{"charts":4,"images":0,"macros":1,"external_links":0,"defined_names":20,"comments":0,"pivot_tables":0},"unopened":[],"bounds":{"document_bytes":16777216,"sheet_cells":100000,"rows_first":2000,"rows_last":500,"rows_between":2000,"halvings":0,"cell_chars":16384,"cell_head_chars":4096},"cells_cut":0,"cells_raw":0,"read":"whole","date_system":"1900"}

{"sheet":"Rawdata","index":0,"n_rows":100,"n_cols":107,"rows_kept":100,"cut":false,"hidden":false,"merged":[]}
[0.56443202005077897,0.69920237529101426,0.89870567564708204,0.93122240601146999,0.97415243446479927,0.11955182990610858,0.59561580545317983,0.5934852785535728,0.86187385261812721,0.93861673546830804,0.57809518940692883,0.96415477008167705,0.6792376247284303,0.22365378112539591,0.87356342397126363,0.63617327819502134,0.90087494252434897,0.72793456152024694,2.9894812643903035E-2,0.8044560939693578,0.32057642111672946,0.79669917416567437,0.54638557873843785,0.49220840446054348,0.89260018589869039,0.17468057679613014,0.57749514222779186,0.2855456344289915,0.16320459609758275,0.50139583233483076,0.60739802448072666,0.87602276390594092,0.45114927536271676,0.84141678681651266,0.17432724028530622,0.39414201695069151,0.92683808742356355,0.31222707765426794,0.29633301197567508,0.4076585720558894,0.47612298622533222,0.43214391928187146,0.12136055810209134,0.70948751937985566,0.67108643074590524,0.14939360360635789,0.80134893689951048,7.1081856298094159E-2,0.26270824267506598,0.39157890482409963,4.5781893972890897E-2,0.14687233792791099,0.32318603815154534,0.97367011082252031,0.62222826004794862,0.75772468182063379,0.42239740958742145,0.78770067515756537,0.67605812596803616,0.55461076816345067,4.7103717780395349E-2,0.97000684346862542,0.17007897335006972,0.2497648275368346,0.58927826963738084,0.13583567925990281,5.5602713576789697E-2,0.72988810919529434,0.95628766119686959,0.35039946220395679,0.87124365886642874,0.83273721976356707,0.93113220825288701,0.2468305225791867,0.59637061068417652,0.71450920589496991,6.2073623675096279E-2,0.9565356926694274,0.33298083529236244,0.12407881578414681,0.97051737160870211,0.38514586070455814,0.97996584037027945,0.15093263927299483,5.6990014411118506E-2,0.21502567377991633,0.66081024632482099,0.86507602877894518,0.85280235771540125,8.666974495886226E-2,0.23390103068018731,0.96741862924140221,0.31961510269899207,0.82416319376295344,0.60507453189484328,0.9285325924912522,0.22133557166383144,0.9759807078575754,0.66625064228971065,0.61098209002644244,null,"Count",null,null,"Expected",null,"Check"]
[0.36727809214240814,0.63010326708560216,0.28835837432358302,0.6931257701296667,0.87907629221059469,0.87434721955136219,0.38355752783167185,0.9270010689987781,0.25683735098958971,0.56350154522171347,0.73247015030798746,4.7372373720043437E-2,0.10545119219306998,0.67163812254297994,0.31160149282335869,0.25009157289266348,0.26821548968166986,0.71923475680896076,0.97143353625061446,0.99029512925816443,0.56268772673076128,0.29281556385313479,0.39844732023645291,0.26785405672264218,0.13321551403250775,0.75730746934923121,0.54312871884385361,0.54262505198415745,0.35071116463554108,0.81128772532704074,0.43836805144083024,0.83335619522037108,0.65423759684949545,0.26750823674607771,0.3681599601993869,0.35988550067478986,0.61764614574947441,0.97152691021541626,0.77180335407891487,0.84540875933940507,0.54577710509460431,0.572599719900029,0.30436084419972809,0.64399593795288723,0.90349775011298317,0.89687339948308009,9.2490471472966629E-2,0.56767516613683655,0.88654523939312935,0.64617839573143177,0.58148719640799684,0.36343020139473181,0.99659049912362407,0.34907812355543777,0.75632321212386044,0.39486454867008536,0.71725993001962862,0.54835274285273472,0.37305159954263323,0.62655017645511946,0.26100238673193643,0.54995869784071594,2.5428139806937256E-2,7.2974629654353751E-2,0.84499652625392785,0.8855372005596801,6.6015776671643045E-2,0.88245721922135889,0.1771678940627246,0.3120350946985424,0.36128866448664732,1.5533173421864999E-2,7.1476131895318096E-2,0.12353652011216276,5.4940874690716512E-3,0.20222623321731792,0.31061951934864684,0.26496019922523983,9.1731322464246756E-2,0.94986556250268084,0.16872782609627712,0.1368813227101493,0.51436045015246656,0.99547362468860834,9.6410789189541046E-2,0.36154585897689484,0.39035331319882405,0.31773431316775158,0.18201085990778854,0.71757989075075024,0.61284779431260017,0.92255728473251952,0.42020412187143741,9.7744062822407662E-2,0.6660275024163006,0.95534705767908201,0.10792844128493007,0.24888829553710545,0.77241595727741752,0.22898785476223105,null,"Total",{"$f":"COUNT(A1:CV100)","v":10000},null,10000,null,{"$f":"IF(CY2=DA2,\"OK\",\"CHECKDATA\")","v":"OK"}]
[0.82249022287598339,0.1792538782904104,0.94062340097205999,0.96528930362178367,0.94680558711742946,0.65223461408990113,0.78194620712324037,4.9635591964743986E-2,0.29163170700842944,0.13944403145941831,0.90725225377633312,0.86905494249389381,0.26555762301958941,0.67991411361841769,5.0883332674183102E-3,0.27341014098444039,0.9728586793409908,0.38326010419904899,0.7862079340569248,5.5277417696362741E-2,4.1498875123449741E-2,6.5090048580926041E-2,0.28886320355406869,0.37418570587192701,8.0896199930270085E-2,0.32959592817730332,0.68083982977970747,6.6302389965453346E-2,0.24179613003450395,0.29515746723175718,0.24263934096674877,0.95409766137458796,0.84507272383302023,4.5914274277200628E-2,0.21315773074917366,0.49237453297906164,0.36706877805240545,0.32850252399006064,0.9035503651457879,0.26347231732243903,0.17603608635244106,0.10262139660354286,0.28279568588079973,0.62152820217114524,0.22607977017513148,0.54617319351822224,0.98099255511168693,0.46768209886578083,0.59477146719466589,0.79733282379740034,0.97802965741137093,0.15386683741867091,4.8827837495619697E-3,0.28373802185048247,0.96316094587758261,0.3856822382262689,0.59716282068222215,8.5565740929397061E-2,0.62305905832604014,0.61287462557323746,0.65093510273089206,0.81292833753205418,0.55734439392490764,0.57961459669543935,0.61847160062831386,0.22410966668359344,0.19548483742328315,0.53849475867397978,0.21392974291361455,0.2282428302888897,0.94401074168726595,0.65730572145690347,9.6850883311742963E-2,0.22165199353204168,0.6578286592367899,0.93182434266005665,0.29253045222603424,0.21629315486700151,0.46891256071475895,0.82494768997742385,0.79188354912606607,0.52583463291669552,0.25684639921786012,0.7078917637266624,0.27077486966401154,0.17198823592901979,0.75679953930436517,0.18683230620145441,0.61209837030518843,0.56411772416181161,0.94668585076895684,0.52709578132934276,0.67569685574228833,0.64314389439715947,0.41744816114266181,0.65834010027798329,6.4914669782938916E-2,0.47693220669096603,0.97621805447414034,0.37464496651835555,null,"<0",{"$f":"COUNTIF(A1:CV100,\"<0\")","v":0},null,0,null,{"$f":"IF(CY3=DA3,\"OK\",\"CHECKDATA\")","v":"OK"}]
[0.26050964107810248,0.69031710045261807,0.69511702051382862,0.32357408259885556,0.81698577399627736,0.80722602795662968,0.25942170379803331,0.22127487992006167,0.66334313520730293,0.3024642545439763,0.63270470581183835,0.15495607958787172,0.31149835704740103,0.17159279499106894,0.21420832461842665,0.47465592827366621,1.2001454349534924E-2,0.32659194332582897,0.92117556427835745,5.2389369868360847E-3,0.53055364298048924,2.6436518749707205E-2,0.78676203613154527,0.61382443702492606,0.50930000167878442,0.21918192221950261,0.83757583935865332,0.78919693008549918,0.62998278436506305,0.53936433014622931,0.87643426975564176,0.33491000741990984,0.83527110714683828,0.43007606510693275,0.91293550516509725,0.71037827036579371,0.45000317346513097,0.74962188649043304,0.8483752863701175,0.33174302050976279,0.61106862991319177,7.9889212366292206E-2,0.95564487228898332,0.25780792231090865,0.9726745181135088,0.53298862649019396,7.3095101924655292E-2,0.21097637303178274,0.26853353934230617,2.4071532908382154E-2,0.52527055043385151,0.32854057336743814,0.84136455656533804,0.48020146450942713,0.362847255244788,0.20179867109133265,0.75161499217485372,0.84594714484258071,0.49018742143481298,0.1864287825795633,0.50348686524794817,0.27359344604444757,0.32330103650352993,0.46583883845851393,0.26373342080922391,0.76195637201823085,0.79176314358304778,0.47563961555178602,0.52173810864790415,0.11339237606563102,0.48103588985462353,0.3652836543749588,0.29960461841138986,4.768660238793998E-2,0.82278794173426517,0.80381344136120825,0.85391738977455034,0.93933650537565283,0.1406508949972648,0.56748323563182845,0.19003551506609762,0.70775170914445573,0.76239057387042775,0.92596120537759052,0.68278743435017408,0.61881922452486726,0.95619031579445291,4.4796690847337395E-3,0.16868178990434468,0.16759085223685888,0.54036330611827621,0.12198200999173425,0.27127742652395037,0.66730896744031887,0.77929514302941383,0.36276071122701814,0.93673152137710169,0.11090450502839488,8.2311677836084396E-2,0.88970118415920141,null,">1",{"$f":"COUNTIF(A1:CV100,\">1\")","v":0},null,0,null,{"$f":"IF(CY4=DA4,\"OK\",\"CHECKDATA\")","v":"OK"}]
[0.8712260992773424,0.74695558603494483,0.43902352353363028,0.44861353190409059,0.85936721752708589,0.19808797438874814,0.52712349934893377,0.96841465190065812,0.85614476790200011,1.4020656913376284E-2,0.38648886223569379,0.4690085729346869,0.53858625938986338,0.8263339695510199,0.65973235611084224,0.94884388079836735,5.1283671141056253E-2,0.43785783121691524,0.30226810260276693,0.3736073725448259,0.56118667706845027,0.86689710121423424,3.481611781029903E-2,0.67634396920815587,0.41241827920170715,5.2581671633895932E-2,0.7460569173048065,0.92491284180115962,0.55088982169422562,0.61324451895344123,0.84928034090329063,0.61451091240719813,0.19508443700980949,0.15350206497935326,5.8052466468736519E-2,0.28822096769745165,0.43905059336289698,0.98789715007400147,0.65901908657763442,0.93292562352541852,0.53208147767972536,0.12004851985747322,0.64386386828471098,0.56522800977337351,3.6188383326643314E-2,0.52329078480880054,0.99947944002336875,0.92614689109524095,5.0557442854201495E-2,0.41375297767732833,0.15225687268267118,0.76857048570778785,0.97541153753312626,0.35571806034946785,0.44643125129068884,0.37484005622333583,0.23140772568306767,0.72248157437319616,0.21996579999624533,0.2347091349234296,0.45986181734159781,0.12958475581968565,0.77960477986655075,0.46202613428842887,0.35034156600198518,0.15306930502800076,0.51830013465043434,0.70821362411129751,0.96125309364828537,0.92311876532446691,0.48177578832726831,0.85122647058187151,0.1777280855067267,0.75340307834601461,0.29084605937520691,0.94530316198356146,0.23082837408987933,3.8502690406640672E-2,0.14644716602686159,4.4226542481662912E-2,0.61619864426540383,0.14731818839961019,0.50261147483322843,0.94836125265772797,9.2816366969192821E-2,0.9807862331556404,0.22869389367964632,0.95631472520053584,0.38750104163424703,0.50350187280839609,0.62256437725492375,0.37713467309004389,0.76245246916136744,0.27263109485826287,0.85493661679643884,0.52051997304282782,0.99550207969914495,0.14865953962747225,0.89732251088914095,0.77217127065915603,null,null,null,null,"Expected","Tolerance","Check"]
[0.62463925289029609,0.52042569229471902,0.54008950713057002,0.9650474601277963,0.83421178599868473,0.95986045409056275,0.7762109978451005,0.51794945878572607,8.5892940086491953E-2,0.15468778349810919,0.43475005667272626,0.27563024017823268,1.3377721850893476E-2,0.4803025503662719,0.93665988759023788,5.5606385917199685E-2,0.35556755439099474,0.92092825134442102,0.97589355645065567,0.42072087710223038,0.80199794963355098,0.65420804493011808,0.51360512415907056,0.61300386528819029,0.66617265211078336,0.35175758189326378,0.10440947249396215,0.971547484690785,0.27029161847057626,0.22491780559031505,0.38506521977295816,0.35816634090431998,0.25046855884135666,0.88588144030014515,0.10566718568201583,4.9243496661466324E-2,0.75303386531682659,0.25359492973123332,0.17607185303438133,0.95307944959274526,0.45464845202116688,0.56160386100973014,0.33068310546230573,0.63403917579320479,0.77638294761603976,0.53652280396984398,0.81341861166681628,0.61613717650475941,0.6296790050634038,0.33500636858392319,0.81458662328819609,2.3811661538491791E-2,0.70734456335676321,0.93159038443485886,0.27152998464483291,0.38827169251164317,0.47095420084760231,0.10460618956041989,0.43397945893553602,0.30052545304377964,0.71146222719847174,0.12724680213346462,0.30051071103177018,0.28732168632005328,0.39437033505440955,0.59695967842037256,0.43213560381714855,0.9922615526763553,0.87588226641387612,0.51914559878873112,0.79956878833451128,0.42222492761769415,0.64207623054188856,0.80557869894627487,0.76560783069232174,7.7444849627490431E-2,0.86045145930271105,0.8492887507357505,0.43729914968312966,0.84005486608378988,0.63579808451919717,0.16838097554542708,0.69783024493619161,0.64668609266174315,0.6035039748878005,7.9359943422824375E-2,0.29751093849663168,0.43670288680507052,0.89938000754759639,0.40800423553565779,0.24707182390910376,0.12735983139331208,0.32625466101256306,5.9228076798527263E-2,0.15186733889597559,6.5991333515528106E-2,0.38116395001274117,0.86543195618842439,0.80376874976573243,0.55501455041729808,null,"Mean",{"$f":"AVERAGE(A1:CV100)","v":0.49838163164733507},null,0.5,0.01,{"$f":"IF(ABS(CY6-DA6)<DB6,\"OK\",\"CHECKDATA\")","v":"OK"}]
[0.38096028572707696,8.9446143310340731E-2,0.315062672054927,0.55290583478886668,0.42789165882690594,0.24742605063177747,0.17604983894258608,0.34013776225186709,0.73067276738341047,0.18009872750156874,0.95041432134975867,0.48465661233835711,0.23426283475581955,0.27662279625946129,0.92394682327778233,0.86960430771550734,2.1816627565863778E-3,0.24328337562301772,0.33755598367623596,8.7135124308609591E-2,0.11236948829158477,0.23097397242629381,0.93933236005289755,0.46089158008690911,0.793324696725344,0.37833413813466277,0.99650700319147067,0.5310600198200266,2.855904049695468E-2,0.14737192716401348,0.94330465064147784,0.79439471991903721,0.60768694243931165,0.14224916505225116,0.51204434866160498,5.5002674951016517E-2,0.8951035163647445,0.63790630792800151,6.4733957419943478E-3,0.51959239806711477,0.81832568887458379,0.54057370056160547,0.3825313373808974,0.37641106545869052,0.53137200105269988,0.10293337354408194,0.97644015518182958,1.756437645649489E-2,0.84153156388658301,0.78688484494902766,0.29768168742956924,0.24079117294860686,0.4148912616565068,0.57449420120040717,0.20931787993096029,0.98948737496049821,0.67887802201465131,0.98068160477670197,0.92886314535817704,0.18347528314848016,0.85161017613558454,0.24146613659223692,6.1759832382034197E-2,5.246184828053102E-2,0.79715568907454937,0.7593577531631297,0.38110231465067401,0.17975377164887085,0.85602696084665586,0.76008217413014545,0.28129228857751398,0.69521102385626088,0.23540020760717217,0.13437742513050166,0.11887570267364567,0.7005934189162234,0.95674933477081492,0.37797602230326344,3.5663259814700421E-2,0.38898536447750232,0.66812237698808508,0.72594659555406305,0.40504285509362248,0.55235096936387318,0.5834179024842322,0.86441998398705477,0.1459934945883602,0.14739417362641838,0.28041023526066355,0.14785497517321355,0.19396366611967741,6.5362440853425907E-3,0.16333294963725264,0.43601225334938676,0.43797174365471725,0.68753553986839144,0.20122244856877691,0.44408149637658934,0.20705831058405033,0.98304020502435785,null,"St Dev",{"$f":"STDEV(A1:CV100)","v":0.28797275219855883},null,{"$f":"(1/12)^0.5","v":0.28867513459481287},0.01,{"$f":"IF(ABS(CY7-DA7)<DB7,\"OK\",\"CHECKDATA\")","v":"OK"}]
[0.52349044512331966,0.36406582313474989,0.32337998436484061,0.40476477292374013,0.50955648751209526,0.98531912716911352,0.54675995281791556,0.23877815103604028,0.43946189759622445,0.11191416392744147,0.78985106371716185,9.2039444974164053E-2,0.86222142114548983,0.84550887096774507,7.9826366311615438E-2,0.42368901086343591,0.11054013173337907,0.59009773899421514,0.12003444313595324,0.49826464960123851,7.1829801611884125E-2,0.8512016801446306,0.9367916925996399,0.82824216588224764,0.367094932675607,0.23038616270100443,6.9412962438864412E-2,0.95970927240555282,0.90925376960048854,0.98152236535357817,0.29394501594274747,0.12177324976558346,2.5560202301601609E-2,0.54120405187631915,0.8632536620920469,0.74085229430950139,0.1745915960445753,0.82154404251617519,0.5319113140248618,0.23078919356157102,0.13956753201533834,0.74831920656956297,0.53952880632916489,0.81283406186500828,0.90657834596155251,0.94282496940644644,0.45087408444360533,0.46450066572891024,0.61306082637337378,0.36021755909678366,7.0806605776861931E-3,0.83806613432177313,0.6807950092222449,0.5093048296996121,0.26649188270182445,0.15246624868672776,0.2851150066206749,0.96197355623113812,0.38588526126080369,6.0438157294893102E-2,0.22027799739839071,0.84796549564652102,0.59598754937475129,0.92314966700182777,0.54670195447428493,0.92711633807599314,0.72425051159067366,0.46759534246215573,0.35704833726468288,0.59483051591653513,0.22344617469907258,0.70828612629567245,0.43751120247596587,0.61058509892121426,0.4764724751763294,0.87052451561716515,0.39233779965124438,0.76044430305289656,0.23187546593976482,0.5557241512032578,0.70589766309220181,6.1154634796834917E-2,0.63493847588029695,0.28237644592724942,7.8187631978606786E-3,0.46730089893010074,0.52557051513930897,4.4842564338240742E-2,0.24129697792255178,0.11507769166216464,0.48157903018707982,0.1972475165405897,0.84380303201909002,0.31571255032650414,0.71435811196509602,0.31681238363250985,0.90588149823019748,4.0561809059637799E-2,0.8453328136789553,0.72440961915283597]
[0.55722069562114129,0.27015926949126323,0.77251264163733224,0.90199265086054314,0.48179411900777913,0.29379568995035921,0.53530470717264289,0.31321840565319281,0.98028141731167151,0.22837054845412252,0.28840737964896468,0.31941685212211812,0.48092669022610623,0.67312302253959699,0.26876744974837941,0.27524447471379465,0.46167395855922455,0.67095713915083466,0.22110776986377634,0.97393018766525197,0.4748768313424454,0.52931292644405215,0.47610069741922134,0.55955943662494623,0.27214736324221855,0.14072888821403851,0.71886080780660511,0.24325081621841016,0.49099568779177816,0.12484528047487364,0.29312427674226749,0.98420047749205419,0.45021147323458821,0.73333242042499103,3.6499415249722111E-2,0.14850469911871789,0.22864676107146331,0.76530119583019285,0.19710735548189706,0.87956064249466659,0.55451571837444069,5.3488344755672768E-2,0.98494498015643817,0.54023708152703809,0.16521679533806344,0.95540667700358395,0.3959265105302453,9.2886673871606096E-2,0.86926459572015669,0.1667057505102818,0.8926792221259221,0.86790985131033971,0.4559058458241102,0.28682434708637861,0.78129347904657553,0.22529966132536872,0.74692334040890307,0.57320932066861907,0.87865314866900446,0.66031899705661312,0.70449079399754655,0.12615954926025763,0.72004226516062986,0.92160076404477542,7.9763205994469399E-2,7.3500726004545935E-2,0.29173841953721202,0.36727902615584218,0.8928165788735033,0.93171574268418034,0.80993105691203637,0.30094675912201507,0.46223048284677426,0.70357297918547579,0.72471566440398083,0.10954936829381745,0.71565285336403561,0.65840050140955952,0.66668280385576539,0.41174081507991678,0.80705062554414531,0.47623701571554844,0.77520421276683393,0.68854200475445682,0.86478865957788387,0.93180432925357737,0.20963315381839664,0.58091354036516896,0.7065825861004934,0.13409237688193121,0.21739719566261373,0.14526603604810473,0.21245021162891142,0.57930275690265642,0.84381277904414154,0.9159300661955232,0.14638219689580123,0.69617606716451896,0.24894784481996979,0.56238653964888285]
[0.56044179570631181,0.64759678225945638,2.8113547219064894E-2,0.95012919275113061,0.17843154608598044,0.30595212558068974,0.58791671196934425,0.45213847730232215,0.21203894718376348,0.76650633881193053,0.38933236803007165,8.2562142963148344E-2,8.9514370224832773E-2,0.81788448804711311,0.68391330219144508,0.92059177290018301,7.272284068682322E-2,0.42654639864027399,0.33498759861715155,0.59772150453929729,0.23371388729110409,0.56600811682641472,0.14419375794146216,0.56679090124421083,0.57964288356545701,0.22223560440268764,0.14110809977392424,0.13089116166516734,0.62218826025191698,0.19917505107606548,0.431283507231911,0.32947154854264427,0.30476970130274983,0.21613801936890153,0.45637017921086487,0.32761778411595166,0.73616745644629011,0.22923574677207093,0.89828607673000627,0.37620369600757608,0.15473996695064951,0.12800371312271053,5.0571259812327019E-2,0.56686930883558062,0.41995944001259788,0.39095449570184992,0.51494434178151616,0.98997602813107644,0.27778188452580099,0.45510420275956942,0.38069523085293611,0.97300708078486364,0.71058514269573547,0.53535007482686603,0.57224320232354997,0.95711029450841267,0.77491591235543344,0.25709243169123819,0.68266236092672483,0.67599291010554907,0.6813663690699342,0.33381474155023572,0.50769949429139039,0.91788177968115825,0.95865168225347097,0.87957090448146469,0.64414805293566268,0.30581111653126059,0.84998469644852248,0.3087949861187903,4.3025962960574482E-5,0.11227338042101898,0.75053809187482201,0.67054338390821722,0.40915308441391818,0.28541060088870784,0.24960026678754699,0.43201168512411214,0.84229268162962678,0.74603423696930016,0.14696504255012643,0.67673324238363797,0.61071053915350137,0.66109913190482139,0.68175016051735282,0.76332161175896807,2.2377729658018097E-2,0.75173074841811949,0.7179799451524993,0.10728373027328209,0.32208586378947646,0.81085619580189583,6.7831185425855978E-2,0.45273731964235298,0.33120984636811002,0.639027295869531,0.86883198370498671,0.38069480488320429,0.90870741487471896,8.7257017026657002E-2,null,"Cumulative frequency"]
[0.48337837413807416,0.61697366261872411,0.8037496707587114,0.65100413139425028,0.6593759305189566,0.24737724264638328,0.73610199234843887,0.33170563341055781,0.82253379388437919,0.31184928890221353,0.61417593893010969,0.1017464576475432,0.33195063825910154,0.78506875395996478,0.60238381524311957,0.43331611756082133,0.36935491943988796,9.7759523240691815E-2,0.95157663738607745,0.1938055882859907,0.10629592298603752,0.78691226057215391,0.69025318060741336,0.19936423089494004,0.6801341203976482,0.80650561104075358,9.9163311927081943E-2,0.48238151464170786,0.4113275536469001,0.42086815964129376,0.14751209848628255,9.3806029181183415E-2,8.2137013039757734E-2,0.32925954733299534,0.68707207198880405,0.6201870343672784,0.70026781761156454,0.34975759716485311,0.62005332261419854,0.7678383520818044,0.32748455634754958,0.30853540436094884,4.6756171213924613E-2,0.11627845135232839,0.2399202212255358,1.8275979901408723E-2,0.98254075221572701,0.85144709591091461,0.64084493513838403,0.96828021095978933,0.51954540612827305,0.80522203370265366,0.56604513756654917,0.12998799877014644,0.66761866115194823,0.92137316392795809,0.22412417965152653,0.12268463881936342,6.2798872226032088E-2,0.9788999426583177,0.66159636759660345,0.63242308074453146,0.29393038157464346,0.40891398179417104,0.87497319096116055,6.3014292946878103E-2,0.56163261852843571,0.78873381820120425,0.2076210323265274,0.53571405506198377,0.52129043481204473,0.18760161258284314,0.38528032767080966,0.41829423376950436,0.37557091696100653,0.75790784499471953,0.65479791765678574,0.85686227327179798,0.84592264744714496,0.23823772804683774,0.93281493157180639,0.49136669911917474,0.66427268603597955,0.10194812790899443,0.91981972113118426,0.7581156759913219,0.17126822597375535,0.77072580959334136,0.38955966642590323,0.76332267379281971,0.63998199182707816,3.8620017486435287E-2,0.35381938156222914,0.52849717276643338,6.7814871164991852E-2,0.12346431544861425,0.17500000763140255,0.44711375919955632,0.71281033648428405,0.87953899221688625,null,"Less than",null,null,"Frequency"]
[0.36101450715655214,0.34722044389058759,0.22361765693509006,0.35870819869202197,0.98938193549004927,0.51145558199299967,0.1795289800878993,0.85467768128003896,5.5383675290958112E-2,0.47165361100848946,0.52514380587317855,0.89691144250585131,0.20231761913878177,0.33979664880946714,0.42946171574803138,0.66627344157695945,0.57023268186780585,0.35239072479852296,0.95633510879369843,0.10425331132682947,0.273224629144871,0.93732106504889423,4.8653351738559225E-2,1.8051352183238167E-2,0.56887704432928887,0.25072683941459706,0.19028680821468347,2.6492224558148481E-2,0.53517883231285568,0.28048642112755118,7.7118390137503101E-2,0.42386253751349889,0.70974336785627479,0.45903782857657016,0.46621183578888281,0.99384729455458942,0.66032878589552979,4.1582611811251557E-2,0.691473331437785,0.79044491123489946,0.39863348397262077,0.15607310286476805,0.45037016742217173,0.89628253385701007,0.3844383687854358,0.4603229802197657,0.16276059748138094,0.16358209996437656,0.5944696178794735,1.4273636878162521E-2,0.68779030261724428,0.61581008986444075,0.45684594504925602,0.30796294290507786,0.13182400555358842,0.62546650037189466,0.57050754454269292,0.40161431512074708,0.16450462347626782,0.43431632473942583,3.8170585372544807E-2,0.45873399739659348,0.68223165278006637,0.51069005304642667,0.5932928527242658,5.5411479139162112E-2,0.18865156817486717,0.93841525359505162,0.30958357551104598,0.17198664155346632,8.8614425904378735E-2,5.5884292324132945E-2,0.96096972083891508,0.47558748172045195,0.3746948283803675,9.6542599488610881E-2,0.87345982341442907,0.99885996632949925,0.60081295677379543,0.2240686152077036,0.8886698365953879,0.14763131435095767,0.64328303044562896,0.48102201369709996,4.023762057275182E-2,0.84255486237581456,6.3647541619064385E-2,0.73891185385637925,0.55092423523578882,0.67994062922110077,0.66740862872995843,0.44716461708339406,0.18744308494766804,0.73895909999387455,0.39405680016045652,0.2455831488524014,0.77857776765124675,9.1128292746655459E-2,0.31671645490641676,0.90121439383577451,null,0,{"$f":"COUNTIF($A$1:$CV$100,\"<\"&CX12)","v":0},null,{"$f":"CY12","v":0}]
[0.99064275367668053,0.97394336549058347,0.19662379149713949,0.6224734240787293,0.35708097526265592,0.22753698964472169,0.30476970873006515,0.72051597014146795,0.99059197469271432,0.39521362085455702,0.10363672876948471,0.61186521818386397,0.81595129711732961,0.24115594202506485,0.10327791274876608,0.34911589831951972,0.8929791293482815,0.58938582873734791,0.29691479444791646,0.14135253749220056,0.51076254089003825,4.5535868856035888E-3,0.74582097008851123,0.72104753690238554,0.26164280884016322,0.75115992648200691,0.55376799981110592,0.41041509195799009,0.38265364042177563,0.43058005569494739,0.77067768845115459,0.45419201109691021,0.64605052917817618,0.90334177557384565,0.73998137459223545,3.8605657312440811E-2,0.37396433057639822,0.15713305852281434,0.69635019154573086,0.33756161988681033,3.1488141577863282E-2,0.32414058553467939,0.15020293941808494,0.56606120249789615,9.5157966204962419E-2,0.90354748603176083,0.53780217945104536,0.5121694227247463,0.6784483208617007,0.32120179607203592,0.71726339539748052,0.89837203792656883,0.43167877074857441,3.1021938236527768E-2,0.40334697703748346,0.38768692795730408,0.80532012328905411,0.74888690119504686,3.8632830535601848E-2,0.72504591172182598,0.8363809023084865,0.26302300811213919,0.85422079941041584,0.94095354523161834,0.24481341335652662,0.24676137713433155,0.4236444798965503,0.35797033917660936,0.48732632744646665,0.21295306159993688,0.39528030493643174,1.9723462568410732E-2,0.79688891698608144,0.77009480341135517,0.59009618392847063,0.33380023487191257,0.26740763275954837,0.22248084107136579,0.21204661677183134,0.38865392462848902,0.66938543294688846,0.20965954346070226,0.84299904048410124,0.57763486070035808,0.17540282849782418,0.27220284546738061,0.99951925511529882,0.21070765438005179,0.11041456143728123,0.66609015078393108,0.89824824340631715,0.42245733701664956,0.69042753833310821,0.8045808701672984,7.8818884582940618E-2,0.24018495787031047,2.1531427710019813E-2,0.15767514403017879,0.35600633908587964,0.22087230318023987,"0 - 0.1",{"$f":"CX12+0.1","v":0.1},{"$f":"COUNTIF($A$1:$CV$100,\"<\"&CX13)","v":1021},null,{"$f":"CY13-CY12","v":1021}]
[0.25262008535246816,0.79352040570409388,0.77611147420182136,0.63760599407652874,0.75781300426383291,0.38658479074337682,0.22851376880569374,0.65824791075587252,0.66307143044078942,0.44678251148167958,0.58109840472731356,5.7304813226940698E-2,2.0118146107362067E-2,0.25611560642967401,0.81210096668641996,0.6550858458534633,0.84103000257351102,0.4369298777550773,0.44412649895367473,0.52418772993896834,7.4155106876146681E-2,5.1646808275579437E-3,0.53628277277343395,0.98483386191725897,0.99593072982472153,0.3712665188526606,0.47595909235022826,0.65066290303919994,0.72542584450714198,2.9694360147679344E-2,0.39005711057489179,0.85752497767249447,0.22375614026306556,0.57263300491530655,0.50404546298236252,0.73920650050290471,0.45352632431702566,0.10594814974002653,0.91148808146666249,0.44337622174363767,0.51599055565738827,0.54508973875319278,0.96748973813125005,0.19559005381378292,0.36862825162042834,0.15163317087169637,0.58707052060113696,0.92378130909730416,0.55976716195030607,0.38097458918466265,0.78452049307778127,0.38426903216266672,0.57923466896678055,0.23902036536486604,5.1187534223396502E-2,0.94868520647136245,0.50130490491875579,0.2267202725016344,0.15178924086952172,5.8740365557740981E-2,0.75739026840858636,0.97415004576429365,0.41586116688468533,0.80925629981280545,0.28790554642105093,6.6500812171746526E-2,0.84894775108457599,0.30116164420049585,0.67917991095467678,0.32173869573917191,0.40455079523062798,0.10725260643111523,0.9782221661774313,0.68342942906173443,3.0080136098636578E-2,0.53384262356453538,0.18467672667000068,0.20053283499031038,0.59590404747651704,0.43659395088666919,0.36613024690901419,0.79267413446980683,0.42412469823863674,0.49976508321333146,0.62637996588247291,0.9965673022698085,0.58364623229420387,0.37226708664004415,0.22639488124547014,0.50057942353439022,0.38606974420160522,0.27736549078772554,0.33334280541539874,0.66579002342010329,0.66899588083139339,9.8932355473549949E-2,9.0098453112391841E-2,0.95494782552292123,0.68907977766042072,0.81084705981833849,"0.1 - 0.2",{"$f":"CX13+0.1","v":0.2},2005,null,{"$f":"CY14-CY13","v":984}]
[0.72292468394279596,0.3070896952285862,0.70100539158510522,0.88022648784467283,2.4127109111214184E-2,0.55545205001167064,0.89633479973383168,0.2041985488636805,0.2339765203019365,0.68302296565263654,0.13091204705899218,0.23210850178747533,0.56733071172024996,0.6213349106480589,0.67839160749367089,0.60026703721356101,0.67766754383299388,0.85760430939259169,0.7748383519011478,7.8674694961924252E-2,0.45897352268895464,0.75761168057040773,0.84861347669141451,0.84759141416804085,2.637912426091471E-2,0.50426243135846427,0.40722561537300761,0.97380769291829006,0.56795287421487228,0.44357543744047423,0.38258444693046401,0.77356815383605415,0.76831747126630012,0.8691891034255288,0.14125800191052362,0.88855440362798721,0.44255912172997092,0.69345527856445022,0.89776343620102694,0.48633628207652124,0.48090903267694196,0.75444877226432505,0.65189554800820193,9.6294963491971086E-2,0.33153273808610639,0.97771670707464553,0.40734111298302389,0.64833051885829329,0.1009510707701089,0.56155622457595444,0.25507555263146464,0.36733173508140771,0.50781972003513498,0.85275380641777931,0.63211790433134585,0.7508212506965557,0.88951997657261572,0.18314423899268217,0.78927314662113712,0.1813246146952916,0.32766759771431064,0.72954636246166693,6.9871950177351594E-2,0.49878826566916967,0.36083223986947732,0.83509207924349327,0.96999283861953378,0.87361400913201015,0.27352195965827175,0.89072674344882052,0.86088529036592032,0.24363269097031481,0.67702099005070782,2.8642617754258692E-2,0.67346076956791401,3.1976235900396777E-2,0.46308362292937399,7.9563789193897949E-2,0.56451538709992066,0.36830905284139648,0.71096095902848222,0.43769465721192669,0.90517813042656403,0.91336324356496856,0.72354473240610673,0.82497795075385238,0.72065624712473131,0.22536221116830968,0.44821485061579935,0.10968810417275721,0.28017229111814124,3.129523171501547E-2,7.7800345973864204E-2,7.6070174365595711E-2,0.8207356744027049,0.34498626398564347,9.2452838471701604E-4,0.88015218850209787,0.19112928496048132,0.15064026653734297,"0.2 - 0.3",0.30000000000000004,2990,null,985]
[0.52782944069942539,1.2447885488075405E-2,0.52540494310885066,0.39102152054491124,0.19717537060900836,0.893665907458291,1.549284392798278E-2,0.36684078831867495,0.81413942521304583,0.49869702830349139,0.21586915053673572,0.45298436633688988,0.56338503031720422,0.33673139585704925,0.19902757780146441,0.34454436250841503,0.47044315881981746,0.92878400060246846,0.43637363018857078,0.46316457146911461,0.41406554902609471,0.78812827767124027,0.98674441273846769,7.4920976158596275E-2,0.10370502920597147,0.11891579823611442,0.77772233595750839,0.59670462104975108,0.12319292083736277,0.37053990861490294,0.68954417971375115,0.30362117083797946,0.14675976100960775,2.1129469701519743E-2,0.91748717550880199,0.10844587757973356,0.38087631925245136,0.37456665771262088,0.2334899441738657,0.8067219958796582,6.8239788658103651E-2,0.73112198139154083,0.21276612238584858,8.1190701491367756E-2,0.66692115301244748,0.71901972074262999,0.1779128944759184,0.37766827311175932,0.19236206250603605,0.44944702083713517,0.34848952880596351,0.90746761659632202,0.62738911243458184,0.82950626562674179,0.75179880713613734,0.7987886255912876,0.26080421789092145,8.0475775988811948E-2,0.25869647915138716,0.46057709294978944,0.10701221443849562,0.84360085296381404,0.14671751130241351,0.73220628486440753,0.88360893218735581,0.80279975650835,0.79670582142790669,0.17790581985842036,0.73115170885746594,0.88169502525554788,2.26455875723377E-2,0.61167523146455394,0.16817096971825596,6.6031323869859437E-2,0.55766173599837632,0.75681217480754637,0.8868214406823155,0.55911885545223516,8.4270673542148233E-2,0.21355602346801961,0.90191082915053022,0.87790191336672818,0.59500461354731382,0.40413209965894159,0.25118958898208799,8.015080652332407E-2,0.77740848028526977,0.79220649226807882,0.99809822072673959,0.48396558231814391,8.2904498117125636E-3,0.23382386272063616,0.33795553718553928,0.21756456897217247,0.80013084437304638,0.927472980579927,5.5184166053685035E-2,7.7773913265277606E-2,0.43336720167928333,1.8967434704083574E-3,"0.3 - 0.4",0.4,4049,null,1059]
[0.67516961413293164,0.95441366854640686,0.29397610734482504,0.83753117480285688,0.96669648995213364,0.37303686553792936,6.3305469312033069E-2,0.76405019154359155,0.9639299679684894,0.95371326768558251,0.99182252270746851,0.10062182219222948,7.797845707552864E-2,0.27596908353479543,0.49873188222107578,0.47938650732671539,0.95245374080662837,0.75815745455450712,0.22768815747272664,0.901197548930329,0.97810687467556023,0.23643431147176253,1.473079133860522E-2,8.2074951811799468E-2,0.70823155342708211,0.37420831729984283,0.17751868610857102,0.14875338403309457,0.77616985406039163,0.51076528962667589,0.52554058253862357,0.53209228155636512,0.68655931222406241,9.7905855279220466E-2,0.10046136107200521,0.2946794535023729,0.76105267809064303,0.85669054231399522,0.97844862095017204,0.7486861626698893,0.92809000726327451,0.49587221626547417,0.93448552873639679,0.36974843714706485,0.30629287823604423,0.74075808110358576,0.76603946448175764,0.38420364533540041,0.41024480223040416,0.71704213321298405,0.2205391120820912,0.84824887668898841,0.31166426986247264,0.2324916189727223,0.45512722306811104,0.89063283532791249,0.74839241144133117,0.72514035288406398,0.23012227597920942,0.61974035177049946,0.24445438774048789,0.94924611367271627,0.32532598515564193,0.2859938780041611,0.27689468696528319,8.7867748553347447E-2,0.37265302405681477,0.9071312215995988,3.3382766318434398E-2,0.97223084087956935,0.66683726199982807,0.61033211413407118,0.93771068467263485,0.23856766928358497,0.36382200786101937,7.7797118184331771E-2,0.93063663103570105,0.24852695076431208,0.80359862959017847,0.1146596315843762,0.65170402641925151,1.6128953217492303E-2,0.28342437585091873,0.3079179766583664,8.5984337536377797E-3,0.4192670236861783,0.74865214594725427,0.87946652184027962,0.87403996853525712,0.79819286086289076,0.16343313127358983,0.89662572849466704,0.35327175208368888,0.40986108713706215,0.87658405530961814,0.68888102527609074,0.26132771791834097,0.89481411881484774,0.90956067624793824,9.4502837566007303E-2,"0.4 - 0.5",0.5,4967,null,918]
[8.1519833432623368E-2,0.66259368885299197,0.3229150795844854,0.83887563410369803,0.25351287258558919,0.70911404406800949,0.11596507787271659,0.89467239581456304,0.57296923144313994,0.58918015525232381,0.71645741802903895,0.33938711617261708,0.9904407981755261,0.30340151417818961,0.55175133597784631,0.37205573228593947,0.20371376013143461,0.95184306961570952,0.34235968226729085,0.16716832072173815,2.1897173927122981E-2,0.78676215705542651,0.38069967886168243,0.32894487372478376,0.87758074746306125,0.61569727081586301,0.12240604010630396,0.93077712424389136,0.5176132250068789,0.25251563421383505,0.40250748089579635,0.45156509502489106,0.55191116250474859,0.28247642998861333,0.9616248438273951,0.60736673949262876,0.46430059455074812,0.58423210330747566,0.25099579835279517,0.80124140520905196,4.1512152885780917E-3,6.098900219930059E-2,0.13899875197947986,0.9339330237908503,0.80679445219235535,0.22681350497272057,0.7865063801656097,0.98592181844166793,0.21235125820960954,0.33064962896882055,0.79893874556437006,0.38023517010929675,0.17594175103639997,0.81228048987072654,0.20961184370403596,0.65058586590946443,0.48002335317867983,0.56500088763510259,0.98446803340274669,0.54406598625170877,4.2702987170939788E-2,0.74048076601698853,0.73087248094378332,0.71259048320740503,0.92532342066710271,8.9549177146301617E-2,0.420664895495375,0.55860106265456144,7.7234447234071357E-2,0.58042412443514657,0.79355857780379735,0.27726657123825338,0.45543629908168859,0.79142282432932476,0.25855123401691937,0.2774793756471361,0.14053596556229686,0.86763432105861571,0.4360190327168445,0.94976777378964505,0.75856786247009977,0.31664733148992907,4.424226146773913E-2,0.4062290831010229,0.74356191780287506,2.7212297320220458E-2,9.4028886616482787E-2,8.8059482003913114E-2,0.16862193234731715,4.6098006120024682E-2,7.2035831545766649E-2,0.68873152997012299,8.8941184133483397E-2,0.62000335302809118,0.28257615968866379,0.23373350658586978,0.617585886613504,0.86092477478661233,0.71938914683460597,0.96337621308592603,"0.5 - 0.6",0.6,5977,null,1010]
[0.73333531433537891,0.61255220313408654,0.89023205688729667,0.96377381901846759,0.70252448577291049,0.66638331322562938,0.23934948626434926,0.40789797768147651,0.30561413642190105,0.16134173881940594,0.31716402802908072,0.13502341120586914,0.6440723456952363,0.99860790782089293,0.1161162703129891,0.9977129194239871,0.82497700268258189,3.9995785820946206E-2,0.12934483733947855,0.20359519598432352,0.87423251052848427,0.38263296684285519,0.81692651257888049,0.29044309373846966,0.95818476225377036,0.89515065807985006,0.55372527230272073,0.60023476900477324,0.52378520645531979,0.99577044288853445,0.37873109781271319,3.0572737575429998E-2,0.71580169849319786,0.80311061718694343,0.52045765716219361,0.80565596198739453,3.4454094285207737E-2,0.50766033336572358,0.78498709747626982,0.10294645463584695,0.38356194099419194,0.76241881705264525,0.16951359474662042,7.1276051917233962E-2,0.88928079973286833,0.76393443642724468,0.86723219005036745,0.82127537044875409,0.55938878780168666,0.61456431757898211,0.67639172477786069,0.90282085640024867,0.77943560916299925,0.87512920468795652,0.72395272968698854,0.31062755764423067,0.83358939823109024,0.50762262303198746,0.14443736078307068,0.6095329388298214,0.77901723881688056,0.31298967679053113,0.38866440403656188,0.34693685598493174,0.94810422306327569,0.27264641988014882,0.56848946757438557,0.5478874681122976,0.78157882526999412,0.3268193381668657,0.60928305927968396,0.60827778012415534,0.31093406757422348,0.24471049926494381,0.75374893970920964,0.24444628946766733,0.97235123404064783,0.74420282830461415,0.41987124436174739,0.34514159300960523,0.53359870269495779,0.15128192648622907,0.11863796159973805,0.27507117117416169,0.63650853123368767,4.3059545281889156E-2,2.360409320526502E-3,0.44671901820689275,0.52929942067353586,0.24815444253582664,0.89623100678064882,0.50170151198281399,0.55160535999615867,0.93605046163526862,0.32932320454539021,4.5017215688256673E-3,0.48922473696609659,0.83031136268828309,0.47319114122493333,0.45358715560092566,"0.6 - 0.7",0.7,7034,null,1057]
[0.52938481795555614,0.45754665879438394,0.60232170372670057,0.78436985102983137,0.96801719382475482,0.2740697447577275,0.28861292308569031,0.23151164049554229,1.040188685371235E-2,0.44019818428411694,0.13322659052173336,0.39153251603615447,0.36060037323384531,0.49357276509842585,0.83800226375657816,0.85270630569051131,0.62305717325407661,0.27822699299680553,0.8346000910786836,0.50949269806501007,0.3043296643405623,0.64696689069902602,0.94969113750011502,9.1055358725868896E-3,0.47634955234609933,0.25585389980912809,5.6804778622082996E-2,0.6301079893793945,0.38303058719873451,0.98883763388347368,0.40576459204727366,0.68677089768615529,0.80864936517985175,0.76534111053460541,0.68837938826049838,0.83106125138971831,6.7128614070418147E-2,0.51706032097318244,0.4733295188804495,0.70877521708170588,0.74826809141985806,6.6319332238808482E-2,0.87540126905874294,0.21380375952147579,0.68619082326345915,0.72924133476595199,0.536980450912387,0.19923050407450538,0.24204849093532743,0.94902627890868785,0.88991858165932303,0.54900215860870105,0.45284012665237516,0.27022523033716594,0.61444787056297023,0.14957742834116683,0.64396477231678428,0.36891195282135991,0.13625400463816328,0.30011576931978079,0.60651743644177647,0.81247120486256497,0.33207803127295565,0.70022770799100442,0.13070069065743339,0.69781769907073121,0.71263468446482714,0.44051069250502994,0.39051534235381313,0.84763335078796953,0.31228050299693377,0.35456983260413488,0.17143672040027447,0.39061177600495034,3.5829206992394891E-3,0.50665598185546579,0.281016886826291,0.22247090838551231,0.26923794606375973,0.19301456135463124,0.48927819051552512,0.18316879459357882,0.38190740583086435,0.70253523774201676,4.0199294529897345E-2,0.49593053776225804,0.62511003535645615,0.62521830813605306,0.96681202036866287,0.57010279117343898,0.79369655930349547,0.8924790076632565,5.9920744330298703E-2,0.94863037378339699,0.30511502053436557,0.95701728598113356,0.86268367892668207,0.49464926591057823,6.6535127514411707E-2,0.15987913806967424,"0.7 - 0.8",0.79999999999999993,8070,null,1036]
[0.13999488883309263,0.87793626247800605,0.48792205122505627,0.73068945873587809,0.48069143686205862,0.65783588507160495,0.63941601317683749,0.37613199502277816,0.33929219806032695,0.59149319309145643,0.79525565590116476,0.22187537098060828,0.63003970996444747,0.6448920276579192,0.21155134166767642,8.4475687340773709E-3,0.48447039386662327,0.98910320551320241,0.11109565655755527,0.49511636840542483,9.2821816886026198E-2,0.23971464478355353,0.54201492973684251,0.86079654230693536,0.78825922263416881,6.8514935573627755E-2,0.17241266777244335,0.94580925084450629,0.9140536449698653,1.2202437233075236E-2,0.22337689974494057,0.37627602914319946,0.53435086934188869,0.29575073223818293,0.44949326411300361,0.86587849361961855,0.5945981087720329,0.77780428528162016,0.35946057670832521,0.66395688786612328,7.8829567196741945E-2,0.21165129939418448,0.41101035963360111,0.39916175562056655,0.84474347853799525,0.99445377369946286,0.86355147889390615,0.64270770278048961,0.81770846713765011,0.21927384208583101,0.40005437081317785,0.99012868848329427,0.45466511981638169,6.2070541663423073E-2,0.46655563892668583,0.36745712362111593,0.11431891970086538,0.31572335248363914,0.80453266088309383,5.89318598973958E-2,0.34283139115309635,0.27924810589749605,0.75838679892388139,0.38939594261753985,0.39440184974179682,0.32880113274778389,0.33309692520181633,0.99123400416690255,0.75053159940707559,0.58626000069840367,0.69514066799298091,8.072680201413418E-2,0.1452700258011993,0.78515803300061593,4.8651109374529211E-2,0.32114310599343709,0.10263500618545918,0.13718953725438843,0.49756386454449331,0.33624541306162969,0.57910301214486948,0.90284335386157555,9.1774530730887038E-2,0.24484950697949104,0.64054337009470741,0.52845501751667434,0.96578808694395046,0.85521829615118317,0.76529587510875141,0.85474971422316037,0.82749055608218969,0.85062633690183809,0.11201124983048028,0.72925399532875224,0.49635333531534853,0.93128928931751787,0.38229084160817262,0.61410968179025049,0.67505390793933184,0.80478666798112841,"0.8 - 0.9",0.89999999999999991,9041,null,971]
[0.29284832812850847,0.77427664538199004,4.6762145492306839E-2,0.25770436603281188,0.93609044492918647,5.8457346730662829E-2,0.94015867427904365,0.10430272978638355,0.74794065816679933,0.85224423736851629,0.44706836908004888,0.46676002570536046,0.25840322604157429,0.78910980225913396,0.77724962249035412,0.53806161400576025,0.4082832111889434,0.67197941214136925,0.55753944698733715,0.73904696665677538,5.6560826760412963E-2,0.37639004201135473,0.88576621418236312,0.77341793025574757,0.43955753604408832,0.87129415827608792,0.10820674120661466,0.11501699163605572,0.7413595587288454,0.84863469547000525,0.63782940237923991,3.9584014469708939E-2,7.2750107380111673E-2,0.593441240569196,0.59835560132823873,0.48217832986922371,5.8857971316170543E-2,0.73091988711112044,0.85478407678299617,0.17632731760767228,0.79741379222609599,0.29109262628146826,0.51813359339573128,0.53676886519619116,4.0460417425643769E-2,0.83472042970004789,0.44125660243120379,0.68676266744311876,0.28294323049159031,0.58318900482019775,0.55245326887655111,0.84254049776522599,0.96690673407502969,0.2262969625831539,0.14509043982016867,0.9924123175094629,0.71846155507400089,0.90123400754178318,0.48269431814138941,3.8575011774497625E-2,0.24740655920811361,0.5512591202895667,5.5436422664880136E-2,0.79432417591338278,0.75135311536943061,0.15650184712018989,0.20352361792860307,0.75197473905359313,0.75386259789745769,0.17383977218210045,0.90161308345800262,0.43259922458455569,0.39403597306258453,0.65011807578202041,0.74542952592217326,0.92789437630518068,2.9412865308560132E-3,6.0741003974502106E-2,0.39685132462743355,0.87564936032065588,0.15165888289487495,0.909674751125371,0.4553755743424851,4.8918175568297695E-2,0.33409877299913815,0.11736843669916242,0.29792097626912417,0.16929824233595481,0.35096007511426541,0.49573430910107052,0.86967754167986966,0.3733102874510057,0.28881457663771992,0.27827787530831505,0.32158955415291723,0.13416031130168649,0.58204426334931814,0.86477086881929621,0.76664816363507482,0.44860240575528765,"0.9 - 1.0",0.99999999999999989,10000,null,959]
[0.87526474633682605,0.54511372491576071,0.89844487918150051,0.76218007457704662,0.99408954426659801,0.58528066971568238,0.2503157446671761,0.36585897586371341,4.8941113551193682E-2,0.9233849664449002,0.17809376207550498,8.7220636823370779E-4,0.49489820092326164,0.57355673197162349,6.0157820947445484E-2,0.13063183467392503,0.39607743062136969,0.85813372069782068,0.27964462592038519,0.40915214148309409,0.38098049737931816,0.84048970910851473,0.5970297985638463,0.28835785118339941,2.1736438604859076E-2,0.16438512023701324,0.31925024400470225,0.63647107160074534,0.80154726145930422,0.68211419989882305,0.70798715935515577,0.57659115710606323,0.14024632523739844,0.91793782009951475,0.36285648202507559,0.21735250929932137,0.60931904433198669,0.30186032383612882,0.37759127226720679,0.27970582092493357,7.0610002509275405E-2,0.62573508523953436,0.76448605814030579,0.8777988426605261,0.37846666511718985,0.25685970051598772,0.99603987419913953,0.81884199350581865,0.6261717106359489,0.84224036865687402,0.76048242148869671,0.58505829382288754,0.4593000454623194,0.29582603182539013,0.60253677049371113,0.49714953229353787,0.87641191792923701,0.20482880479970966,0.78233932759056057,0.79462879655053553,0.42938470537450846,0.2578518471749186,0.9478678462414194,0.78159137891129493,0.39989051439348156,0.13268343769163482,0.19285700832230657,0.27712884481849642,0.14286176831116471,0.75060164057886514,0.98826955678791206,0.75063761678450558,0.91914392347229179,0.22078708649468237,0.31424499122681404,0.81119476373236832,0.11695291879455449,0.82381328545646904,0.72878985613233871,0.930780778362581,0.80971726727758953,0.98026177176292828,0.88204056576795409,0.96074218745101558,0.73373761467119403,0.40041781557951017,0.94002321436224134,0.59331638722673363,0.55251450087013887,0.59328262663400366,0.24697869376831971,0.74493703740271167,0.24504185146583668,0.5648400547898268,0.86936891000510608,0.88525592731887559,0.30972598312633925,0.48697217898282563,0.80004560836456784,1.2672453260121896E-3]
[0.17609534240958258,0.36889048270569835,0.48506458592483648,0.74013834438395298,0.90219233191746073,0.42782345018259393,0.56100696027825325,6.7003899696758018E-2,0.45854676510372305,0.35032487906218812,0.34845125234153218,4.1285230359255132E-2,0.29053242595344864,0.7284078244429425,0.22478409329792781,0.22607533715313322,0.5565215180464872,0.39137638744081482,0.73153200497674298,0.30894340560647149,0.52390657659918494,0.15573261003007799,0.57855571781108006,3.5448942873870126E-2,0.81488858914524553,0.84936183375789276,1.3519940339556835E-2,4.2653869642368836E-2,0.79069141509963792,0.14299813180259713,8.4990899983332646E-2,0.53628649322949329,0.13007718444779703,0.71906320413666525,0.12643259594538503,0.49348978559448731,0.46885444463987413,0.79286010876046797,0.73618978872533414,0.2658081906487384,0.98767861597892959,0.20684370628383353,0.91741315823225045,0.92208922425347906,0.60242774270552735,0.62085603362913022,0.8815408231457541,0.52849580518824368,0.89706754890347862,0.75426016306513211,0.29469978817593345,0.12881202649667911,9.495481566524766E-2,0.27378356991113539,0.5918229281546844,0.53610452053482882,0.38922793390880528,0.34853146825705528,7.8215863076660064E-2,0.47336755273455877,0.19749234910756475,0.61686905860966867,0.29822374130134965,0.73784429124631568,0.7194355583086165,0.84637132301554718,0.86882647306456162,0.32425806847724437,7.5285789533503511E-3,0.94343982494001177,0.21842255767612939,0.12226241095769741,0.77676027299296446,0.80572821991628851,0.79631849157591794,0.56327899181137131,0.84261837030571096,5.7432457356299094E-2,7.162219969082062E-2,0.77607074293920864,6.0205885351558797E-2,0.41101182806007419,0.54037871047279351,0.6089590119107563,0.90512381657176244,0.37978898185306953,0.32846521186162714,0.67402667697173591,0.40330060520515565,0.47148827736424181,0.70323789308837825,0.73649173461369921,6.960483525676453E-2,3.1620880482037372E-2,0.79905281373456649,0.85355623869240227,0.96011420666861658,0.71271808059144881,0.4027971199118191,0.92328355327672496]
[0.88339763619869738,5.4776169077539461E-2,0.96059398210322577,2.5942869842430549E-2,0.27372735883944288,0.47576430689811122,0.92552688454230558,0.191233421680575,2.7873013466932717E-2,0.20496702814251455,0.51184022298178045,0.2295698868040833,0.94595656353806412,0.78793639328455789,0.7126487092010787,0.24644438334396779,0.38335277232007148,2.9427391291641847E-2,0.9140323138310632,0.25752165934520477,0.52731042872160405,0.90519277278598098,0.72428306559569799,0.78289970702269429,0.24839895676484269,0.25136396326949106,0.37547159881741476,0.58854750987498017,0.635213597343803,0.63533277236958552,0.67727551348503645,0.5786996098480548,0.42582992068511782,0.36669405033535007,0.21779648109032768,0.68461251741050655,0.48458299227372748,0.3666763267945955,0.54784174398684793,0.66352862075171504,0.32006022215030883,0.31758165978264041,5.3143657550556278E-2,0.49055441731946126,0.78550222501166456,0.88543076945869037,0.76094280814831283,0.15119926071927403,0.1559825779776034,0.94762689776450881,0.79274276542444477,0.61773173935287751,0.49927350739391785,0.17498546192695508,2.6501221497146621E-2,0.17290338779369363,0.23544616907078297,0.18013874341685243,0.58681121595915364,0.63671339637020774,0.3615752177457815,0.41913119434319646,0.2669253179420783,0.19142063949354693,0.26754305382017807,0.18022608403406526,2.6040593176320681E-2,0.40311336971768175,0.7473915723487331,0.80433029931956534,0.50999792384174414,0.67575783202067652,0.35411502182260091,0.24328383880935178,0.98260691064128203,0.11258317967368203,0.44136835361739812,0.89100840184209962,0.26253483056536153,8.681510866928599E-2,0.87650371250122583,0.72925640763391708,0.69508406541910894,0.37156151291074146,0.72613805967484124,0.29898257950400198,0.49983175309018135,0.25007522133556825,0.4217049125547101,0.14872819517768043,0.76463130121790557,0.55184570912400821,0.79549091735052635,0.60059186847588431,1.469828692340569E-2,0.61719949387880435,0.17724509479980621,0.54605081016933088,0.82380045018229853,0.55084695888103186]
[0.64345124834312695,0.50994736847005528,0.80793544532839345,0.708393598053914,0.99078025236270739,0.2508913841741095,0.48036649828678968,0.55099321785314981,0.53149360908079268,0.60068048530369966,0.42828489393846447,0.9470137609847441,0.8953421066125804,9.5079913586594844E-2,0.79101699588875773,0.48532272058178239,0.26817797450579217,0.10998631289190675,9.2718754735618525E-2,0.9627470800449105,0.93318719718287835,0.13544554338633152,0.26372721132517085,0.96120824813026029,0.39882492771437794,0.69282852448796539,0.90312846873933927,0.17524992809332085,0.81611707388516164,2.8035320830525068E-2,0.37253315843941981,8.2545337536269914E-2,0.7536639338317892,0.31377436222454036,0.45780248068268758,0.10171608868588622,0.93258913095676121,0.688467209868729,0.66954384306206582,0.61832011037445844,0.7466418755469123,0.82730340836326011,0.59832020392931073,0.96965752253631809,0.3640729942134413,0.71332437831064188,0.64966783724248078,0.81297272646632512,0.8208151496021191,0.48502576323561841,0.34179253912603857,0.24396227791097991,0.77054762209579508,0.55317203449163643,0.27849410343783576,0.6337901289866601,0.12985532918104403,0.48805852026597574,0.60402472448865074,0.53031121580629825,0.77414803534770182,0.80225478416485752,0.75146817340559091,0.9562925604698882,0.18814617433633363,0.27337493938480606,0.80970551670552204,0.88915302156728016,9.3958939625377158E-2,0.74740395060791398,0.71080618254569794,0.77264430212088453,0.47566210193103176,0.24389748367023856,0.78564837322161529,0.41412263904712077,0.81322308727824688,0.4297212868099054,0.96168566695736912,0.78886807530003045,0.21856204303917226,0.80317700465436415,0.54520090064068438,0.46366972882773394,0.89915078548770977,0.88531169896185935,0.76821945383592161,0.13920141737968827,0.79294272593531889,0.385250759347885,0.99616889905947981,0.71692206951953252,0.72486606975700152,0.97413273108027165,0.96693209592744034,0.35002286158578799,0.24432872016442642,0.42700873610188361,0.45908165065977669,0.28300719615369396]
[0.61461834939888227,0.16795720642804413,0.63866785267725223,0.5703481981196582,6.661986623822802E-2,9.2305968565547625E-2,0.10779653858628302,0.81527884235075732,0.57800523256949321,0.95765424891372586,0.39001340166410547,4.3266493085242552E-2,0.76570888349238631,0.41735286385436077,0.98289522306951616,0.19756883816258708,0.58487985424865085,0.44205536453370664,0.59436849213243403,9.8908910214690171E-2,0.26457261110001129,0.71066579999407709,0.75300153748398613,0.66281321286399031,1.0197053185712401E-2,0.84570478516461767,0.12569649444225139,0.28946578528424161,0.82396626341549817,0.39673297565483978,0.4843975619264641,0.10427516805168724,0.47716507011144293,0.72018533413220587,0.91837529441766541,9.5312368623322596E-2,0.56245208660306589,0.44845632023614757,0.64164284835048147,0.71704205701936707,0.84553312791627933,0.47115802162038922,0.37773912669398069,1.901762305333432E-2,1.7470287177375532E-2,0.96077501442896041,0.34234636192391565,0.68108021722076817,0.62020826502777648,0.19865567016508245,0.67008712988477248,0.38494761770256458,0.76728776668071597,0.6656820926163296,3.8327665252065657E-2,0.33094922413531203,0.31238210036059677,0.70128554350829619,0.51030391143556553,7.2802622043339538E-2,0.69335249927833342,0.67676333877667805,0.90620124171273186,0.76970776412065633,0.44920491782082717,0.8793688723932549,0.73984110022915572,0.71572297726164114,1.5682139449947341E-3,0.2135235420373276,0.88104938791211929,0.2767627149730526,0.85963486487574903,0.67876361796716922,0.39749153041951635,0.64987172428932272,0.63643176546712432,0.2690966838318215,0.86058075374849663,3.0825944349255008E-2,0.57736353191028866,0.62784097357483182,0.76933775291057116,0.51334379589827184,0.39949425330804345,0.99316609780485388,0.39448766490161535,0.98449087284670922,0.64243861971550609,0.16287065255260047,0.6663391868960038,2.1509509277990446E-3,0.30668140764357277,0.4913086411102936,0.86681394752325747,0.52443825474517825,3.8150088549594785E-2,0.14474036306575466,0.52197677426051425,1.4923026685754626E-2]
[0.66062138834821327,0.74132074677196436,0.89805195794696036,0.21752310648354622,0.72888868506737259,6.2862118059184846E-3,0.6972339671024077,0.22575138414031515,0.42751840072392744,8.1762301927493453E-2,0.76947277034328188,0.36579928825218577,5.9413268638784711E-2,0.79927166180754683,0.12299759055020199,0.87046140583484943,3.8247583420830455E-2,0.77125742265800312,0.57946426520222261,1.4105305666566426E-2,7.3380149055744193E-2,0.78055502622880257,0.56068614187099486,0.22410142416205525,0.5661580602795675,0.7718853943002566,0.67607064205963763,0.57316420326734574,0.83449294607972624,4.7092822423981051E-2,4.5092376462396055E-2,6.9161493194486279E-2,0.76007426294062452,0.35201014596060642,0.40929810355713747,0.51915665565217262,0.81330694972564876,0.58577052968963272,0.12538290124087192,0.41363970990791821,3.907461838953985E-2,0.1473272645938859,0.86058385368334411,0.69311383149018391,0.31715988193381928,0.27921474590040896,0.31560969645680703,0.62439910776691654,0.1025372247781654,0.45984612906084565,0.1757470795403806,0.44604378512199216,0.40981614406785649,0.74828452312350224,0.28965191698830428,0.64883478986360155,0.41855735576645337,0.93747992020316973,0.2408303253885401,0.22149761740099128,0.52949483327936531,0.56180799528996184,9.5402431037538982E-2,0.89407320623839859,0.92294993987609941,0.39540591747798093,0.2249968543981633,0.39513195524936795,0.20320983184881025,0.41803736483383958,0.45411175531610959,0.41998352117661653,0.82417589332096397,0.40422553937842298,0.64834378141564197,0.27964511690274507,0.39472632224580739,0.33745933253114946,5.9825492966888327E-2,0.39562296557565435,0.50615545824740105,0.35264043930569289,0.63128692357477023,3.459309736540761E-2,0.34907953966873329,0.8464875336116664,0.72213405951518017,0.5601113328339512,0.73239867840459272,0.55467955208108954,0.29711577611176943,0.26530756586237314,0.80740296991590077,0.97265267977126557,0.79172801645719104,0.35667531632344862,0.77591909733098408,0.62279962982060066,0.77629302666568201,8.4000972953837794E-2]
[8.1309738818113986E-2,0.63618251218922928,0.37034440596435925,0.15940942921311807,0.91083101466344152,0.73958660604580528,0.87688633794907522,0.43178203743270083,0.358975564097894,0.64568768029998402,0.57707816439006987,0.78185155486059432,5.5196500354370182E-2,0.75643958930416455,0.86638144037211273,8.6086183198396116E-3,0.21671903025155614,0.65012619719022724,0.91048863326299645,0.89099930993847964,0.71037883165652105,9.4651515762032123E-2,0.68746586866530002,0.73120891391224763,0.17521994563807308,9.0860066722762478E-2,0.33355412053081901,0.15254184699314155,0.78479806371174621,0.50784759466159746,0.68309625008798913,0.83191293562465807,0.6404405849581748,0.79329413173487429,0.15051390073464765,0.58823178233734086,0.65149762296006997,0.29706979916890686,0.42701896491680502,0.75376604308312467,0.74313407787435504,8.0831471575070202E-2,0.96239187861065401,0.89586728497543255,0.13939917193457685,0.99483519183689451,0.52206015903407343,0.58771172658448767,0.13663793683550263,0.65499763581982662,0.2048904977921796,0.56444312137150565,0.58416034902293457,0.5722969309488779,0.20819632560879564,0.62746640448248192,0.80772496444118247,0.56801016258908033,0.63125140598523322,0.28902052045335602,0.68069089305401143,0.9459036681673535,0.39740132199072031,0.82402472160074447,0.82212357267187441,9.3279620138023267E-2,0.68975300426238584,0.8269954029793144,0.4637573818594295,0.53542630910271716,0.64387800010732055,0.57471599718211319,0.91978953852502865,8.5740202519853925E-2,0.35377533346553536,0.73043234543833924,2.8348767517649476E-2,0.73917137118061105,0.13216315420931057,0.42815990804200255,0.40927529982861022,0.67059215605287503,9.5232475739912115E-2,0.47470057974280433,7.392407285319913E-2,0.49821510188368745,0.31558859443901155,0.56082259342082175,0.80550793896066675,0.86071756069866756,0.65859752695680573,0.84537586138712151,0.20738031477958907,0.12765469061962031,0.64717914078436423,0.56492237762276964,0.94803444017786376,0.24037448600532851,0.51608618348749591,0.73918168940893825]
[0.2457589880114468,0.80315398899368229,0.38224612733708629,6.9722360133272154E-2,3.6854662008037553E-2,0.79370449516427288,0.63350483934133694,5.9640079007263647E-2,3.3939059490066148E-2,0.56031889478548513,0.96419818626824438,0.38343017077484731,0.36144688475506115,0.72321751196126505,0.7754455437851081,0.49809812011354293,0.25327390821307727,0.97527138955956683,0.96933471233187873,0.39281786105738081,0.31373201331532652,0.18382127853894714,0.91584009687247725,0.39821644726217031,0.80795730321139669,0.80481044266108615,0.63627281995117957,0.41625805057964838,0.19461419532545299,1.2308467195966233E-2,0.1543866654725834,0.67573244849327996,0.38098952674625164,4.1474759797010652E-2,0.7936188988231041,0.32973654955368414,0.77172794794617894,9.8379478304482237E-2,0.78506041733752352,0.75806358271051322,0.86587975110547422,0.48218123952116754,0.15989969233455248,0.47338594127362421,0.19610765821640364,0.17712364162167293,0.15552322117925033,0.75497244935950014,0.78227444856823602,0.2306431192871593,8.5134691825765607E-2,0.23579036651882945,0.79581441105373263,0.80359665398832003,0.2231013210470334,0.95547692584339106,0.9664905569135479,0.83591421256664133,0.91880905475515118,0.1230175646697752,0.33435923786132415,0.98993240129283222,0.84487030854994416,0.10210783695323433,0.18388775459943685,0.95262974119521926,0.83947419526396028,0.28865580428572224,0.44506102093721256,0.23979702900222533,0.45836852776583892,0.9984480778684065,0.37669211712274764,0.64325349160299994,0.39470095186791965,0.65793772578937881,0.14701012557558379,0.43971181375486079,0.24991489762689245,0.64939239595471443,0.35186652248895245,0.57564936037251957,0.80405489785077733,0.91968955190306922,0.15133261650245411,0.34986419537761237,0.38917751099477871,0.58335778328226184,5.0640139117253069E-2,0.25777958126980904,0.88409147666138244,0.75399026447006479,0.51267729782527838,0.6861166200327623,1.9599012579619379E-2,8.4119005291212079E-2,4.4370484770256735E-2,0.26367102826676658,0.39007485944902764,0.39957279238763665]
[3.1752416638812564E-2,0.17738437290853248,0.80741068779088077,0.6809115950073088,0.22317214516750405,8.871371496092495E-2,0.42537869124810568,0.58343514832989252,0.31547455773628397,7.8143544874562654E-2,0.23314344208472026,0.60645308091037176,0.14279122494357033,0.55904642326283782,0.1664946293084707,0.19406290811596372,0.17864623874579533,0.2268156908028468,0.38470197871347922,0.20639354731122728,0.21666745214159866,0.64845414453627137,0.77678778335006271,0.67213152773495777,0.5295983186672989,0.90434176673085753,0.38859477455443503,0.69632062737181022,0.78208429201710994,0.51874179266838749,0.67337507405882235,0.26048180131929843,0.85840901598104147,0.9659015309695852,0.32305751840571217,0.47051809650446297,0.68142957393121117,0.88634062723818141,0.13352754268879208,0.42455696295363943,0.58233401486344505,0.44077401592827248,0.56855152927850416,0.80013215473289934,0.33474368001252186,0.6196497423706554,0.65372389704665368,0.47270656697802116,0.26371839613244863,0.62812686208608126,0.38596619850920166,0.20180070522178006,0.50272148651599868,0.13104679347954762,8.5334870186551504E-2,0.86494807378105221,0.89101778274756327,0.18006988795867807,0.98831958501162243,0.44643955279717362,0.44613330012102759,9.7666550751146164E-2,0.40105265076917151,0.68211697365324164,5.2862531876438301E-2,0.55304808368078251,0.75304832816671785,0.87515966621357799,0.76182999678142538,0.17222186248971649,0.3413937083303662,0.34527649714976205,1.1976977929650801E-3,0.98421951022987619,0.16443303781891438,0.5822540416381351,0.18835973306674458,0.14254066972652413,0.79780313891813148,0.18919240870891163,0.48421664319194269,0.13516173492875661,0.33915128353837487,0.43026805299052662,0.17006003599035724,0.49152419119793334,0.73214125503122207,0.71403275399365962,0.92677551498807142,0.56606969994750267,0.75668505649890083,0.10476070111394409,0.78972107305732198,0.84409522292673844,8.8743874784883325E-2,0.49127679289754267,0.57439265448752663,0.49687928436957818,0.73812567323236056,5.4909167237376599E-2]
[0.3555920351177323,0.32288103682129077,0.44859329015216654,3.1307394838056002E-3,0.7106355067691118,0.19361554710077278,0.36492538988635403,0.11216250986408738,0.26266983632040175,0.41102340800114667,0.10892144316462038,0.27502285685810424,0.56014854019181182,0.87755008124026113,0.26710442366291942,0.19095350955623658,0.3910224331214156,0.27488614289878999,0.70380218711700171,0.93377920742680121,0.60882210702720896,0.88682090086196785,0.34241441186507005,0.44816008356108239,0.70636646234693867,0.53272765147083467,0.68323064945012246,0.67734683982148447,0.36172188315418463,0.91562528005564714,0.97767013473480724,0.31966104914713078,0.76537463866445599,3.3934897677723175E-2,0.88856238840766244,0.78647619671234903,0.15784150169702593,0.75099642859872084,0.22899053604846065,0.81249950076951172,0.62094037047855166,0.5504949016881876,0.78953586112753205,0.67989453690302581,1.5428407588267912E-2,2.7453239319242373E-2,0.21784375611407547,0.62198158481213983,0.39197170803737202,0.14191346313814701,0.44690891817458644,8.7876814660718505E-2,0.7842471813660864,0.63288021994591293,0.93857522443053598,0.5725211527489068,0.37804122865846912,3.3586710438289313E-2,0.25685426540164735,0.41804807678827927,0.98058101422289501,0.71199616258945064,0.68895769727342404,0.41579996471299951,0.18841763306401194,0.23638976235850317,0.43482568962887347,0.80758044272855145,0.28379060554520463,6.211309199500914E-2,0.98125556194659902,0.23550832318314796,0.58310423667235323,2.1088149719329485E-2,0.62085842262265223,0.82496063871062464,0.58677953829339757,7.7952124416108437E-2,0.71644190552427423,0.33344475859758083,0.35960300198754624,0.91131434182974824,0.47130901629391531,0.39121811239886006,0.35935336506940763,0.19407940566510351,0.80484528327892291,0.29739126031676599,0.26805943867320747,0.65456268827107189,0.46173192678531561,0.14423829428939494,0.90861842249632552,0.6560740291335061,0.59671724507793977,0.19967180683760899,0.96117834057019558,0.6696300144392402,0.5458415266484471,0.87796970059732971]
[0.50456544735465669,0.473927925500498,0.94280774815366308,0.39942211621803136,0.94782101481219005,0.96635242872571847,0.63753547995484305,2.2090075859992342E-2,6.4299686686269175E-2,0.79887798898748752,0.44863189023484318,0.60891256421460926,0.4025310106165586,0.17705702453299177,0.23081309278010342,0.51425836681523474,0.53359723871487785,0.94527325956430197,9.7341259069472885E-2,0.93633200403221462,0.32904539164945723,0.23398447374401365,0.13796408456536158,0.41651460141457608,0.5307894299785848,0.94086439160292934,0.43624891400999555,0.22688786381094594,0.95353307197000692,0.30400006104299515,0.94875750389739855,0.90533876567613147,0.23903842443671997,6.1684851221943782E-2,0.92732875102737289,0.54549202466336855,0.84638671071234872,0.70653043296620366,0.90868300715593942,0.96807115680421163,0.90681605392389264,0.59360988784541258,0.78298273221222259,8.9617179889973642E-2,0.51035118195840334,0.33566660115208391,0.28526785134307897,0.54920642476676595,0.84975236138573651,0.12913854980851658,0.66368494456145832,0.46712450676773787,0.83750444871324936,0.69127183988542151,0.35344775758538305,0.85031717627632952,8.4803478794153953E-2,0.33435566849997067,0.53422780991309093,0.65169908617884775,0.39229328394524998,0.85543062514915846,0.34456329343018088,0.99246391101572062,0.96983620354971134,0.82441784517318828,0.95869902139865149,0.27193092230698013,0.34876558394296664,0.32304464536164257,0.11470893505013691,0.88866717821655139,0.11908912226923152,1.2023440377150196E-2,0.95865547132617335,0.62568107902444436,0.67867391952399547,0.69485895547858334,0.66612418018707509,7.0790751840669852E-2,0.42410093743368649,0.29750951188843722,0.93422705252882698,0.14128354288453482,0.28994818123761845,0.35592287207077644,0.58304765462669161,0.25977527921233001,0.78535265598013204,0.14610065183781762,0.22959569858067008,0.61956935117151057,0.82694619887878784,7.2872015074875951E-2,0.10106181037516238,0.96834331037117727,0.91093521205446781,0.53857599111952459,0.82433557754546127,0.65912104841657071]
[0.60272309544852842,0.10532673672928827,0.95716116249208105,0.19447946905883173,0.35089696035690388,0.19723268475187161,0.16536110441288554,0.58557173764307502,0.28852818548622405,0.15787878411289458,0.64711196182815289,0.5124427890644434,0.36441883027496846,6.2782696352847167E-2,0.81951824398979767,0.80689255312715213,0.95857478820232589,0.24808986456439308,0.46965049856500518,0.26530298983747491,0.50190759678093411,0.73620731548687979,0.77680911685631571,0.55423026398243047,0.39661584271523709,4.1769397507214645E-2,0.18900050446081962,0.14711974879809764,0.15078865467095703,0.38653571230762773,0.74438989861056881,0.68750475596737526,0.20650016548841599,0.75455181989652953,0.72584381689960986,0.51901558867913922,0.99583914659781869,0.60357922530294161,0.39776579939929335,9.6621553207294042E-2,0.60623940291440792,0.60553094774950411,0.77989988884863293,0.53706948126187271,0.46673222968824779,0.37157211482560959,0.8965862652757759,0.79085088830673689,0.97711446507433286,0.85143621255976387,0.66057966528660539,0.98827992051765079,0.87742409913514274,0.7314227204733349,0.71408567014693336,8.5823662775444842E-2,0.10521438398730787,5.5135615886053646E-2,0.23618527857692728,0.41555247068046852,0.1571307908465025,0.50493286547917915,0.39714024471035958,0.52006867784521693,0.57099544814829062,0.53848363231860197,0.30386730965764674,0.46772875434814798,0.52688259473842014,0.81778462891047432,0.52017304217062643,1.6665468461702471E-2,0.16979095096069174,0.42213105016648478,0.13126440593473976,0.50960116107057396,0.71427366655666746,0.54758998691561012,0.29925993253513394,0.86096541134775406,0.44119272933313158,0.39708614704678502,0.11875727560866445,0.46690709015827037,0.47214795176942015,6.8330251588939017E-2,0.65587682155685134,7.9177575217163731E-2,0.99854168144307109,0.62967715062023555,0.71112372747507124,0.18137889272908037,0.64002507845003997,0.78846054564627144,0.20360108879177796,0.56411817965451161,0.93684099131261533,0.97420256979701902,0.32528428498027484,0.34240294449101261]
[0.33963884186720483,0.53756769087154843,0.22573547507935887,0.86978154051773326,0.32633564445611263,0.1943904745569256,0.23528518755273253,0.68382677868107333,0.66589597575657355,0.61985013580459691,0.69703114425291524,0.35092676822037117,6.0782971288670606E-2,0.28909145119635604,0.33987562709406527,0.5916188317536063,0.31178524584567513,0.97369506050440846,0.40835661520780098,3.5019495487762176E-2,0.55758435538386353,0.46849287819584173,0.9942345415400774,0.18228404331665993,0.99614738223300836,0.13717328135960005,0.111464466776519,0.14453675249165088,0.62354614540241682,0.92108256160022017,0.71110165035716788,0.76321497488691015,6.7431879479640244E-3,0.53876074253647366,0.8173342221522143,0.98693338800018171,0.7140781842852536,0.59995173288259362,0.47036091184121065,0.28142448111327079,0.92283297395961761,0.14330660266775652,3.9781223892968676E-2,0.24934946866834762,0.4094392948729364,0.81998251884486373,0.27835515465577976,0.8138602222682958,6.2791854267730596E-2,0.57850098221732016,0.52578104592144936,0.41381457651534947,0.89237296082906858,0.42909375097281222,0.86872076427354594,0.63444978103385041,0.70898307963599549,0.30570564246718135,9.2736448624057832E-3,0.44362281171881257,1.8313326203936664E-2,0.67876899922671274,0.89992428287597137,0.72245419847283887,0.92470749878251113,0.53362615308401351,0.39394229668519487,0.27251916142862709,8.7333798481148306E-2,0.76394852499920984,7.8434886985439767E-2,0.71833188497447686,0.70537076915489161,0.26578582132846207,1.9329913263406717E-2,0.16674069955194848,0.63396320116459681,0.81003497670051028,8.5098544894552375E-2,0.38739516244067884,0.7258365449659876,0.30037716106850432,0.88570835794459435,0.26584295421407711,0.68719543388900262,6.6903168999215001E-2,0.83902101796479511,1.7161970101244317E-2,0.82255959450692329,0.43261681441183075,0.38674058752868923,0.23770060191831976,0.8300137004760284,0.96672628252715187,0.80215147967430256,0.14210697293888452,0.72226045067113886,0.66710735198065574,0.22774989469126627,0.26804275629065355]
[0.15918176619371116,0.31513142606985467,0.10002758025355296,0.54437486951328606,0.15842390389950634,0.30134951849993807,0.9370944565671685,0.38454513604913343,0.62960856330992154,0.92181002392364497,0.69494395275608145,0.36400341391009428,0.25539665603954798,7.8973131137941466E-2,0.70706133035748608,0.98518624150816692,0.26353734162794662,0.23515320008465934,0.95479524813262528,0.78208582352053657,0.12745417914914536,0.18688515253917293,0.46732045946498846,0.73111848453965522,0.1529854637297533,0.24908410284433058,0.21608737815963397,0.68459389981200847,4.6138935336145881E-2,0.44875704557452145,0.68667145471071711,0.97545488111929579,6.5525798814311642E-2,0.81003272657817849,0.75545185840923101,0.71922566238715313,0.43783913751259707,0.54070529310785487,0.78214040081200598,0.96854077619450718,5.6750678927163123E-2,0.10766255024703708,0.78306556285339446,0.62481600614573451,4.19450162457915E-2,0.54797308332489647,0.70225174994294581,0.2955733023791377,0.78671012664826812,0.18924975524291554,0.88233131507678675,0.41238861169599983,0.25117077652933251,0.42110112599558724,0.58769064340550792,0.36445593118789865,0.58425100089500792,0.83543882834285843,0.37172618691347836,0.63032141393798968,0.9614905763167283,0.23689153007800079,0.11093022213565951,0.63726879486820998,0.30623242505788451,0.97174061431544734,0.96782713568738588,0.36825944151861767,0.1955029431294526,0.742592995721018,0.96458675004019057,0.24267587613838504,1.2613317372307975E-2,0.49671288143469827,0.58675058879255848,0.86360385589754984,0.96239659919748999,0.57957973383712547,2.8859041435432387E-2,0.13626812160777879,0.60272499828764781,0.89162462421880206,1.1740385064977099E-2,0.46925054357869755,0.73304355935763488,0.98686429808841913,1.4179075463413016E-2,0.7139405044751902,0.52176757403540575,0.34138776829493889,0.56836447293155035,0.39706218824231487,0.6350447859788052,0.44836085439862672,0.16495325731079435,0.3072055144145055,0.16362540586887719,0.70857812965130695,0.95071282516404654,2.9232460947914207E-2]
[0.57517289748116163,0.31606184110382007,0.85258359098099723,0.78295665488867583,0.14648254493826396,0.35542195595373716,0.21328146617752608,0.87367993941474131,0.88143856856825575,0.50248962443995582,0.53474593661704928,0.82700062322453571,0.13704011878917033,0.60978475438672353,0.23259680639305869,0.30642114384477181,0.88582101021880133,0.73203374149359146,0.78160093737076386,0.6991130749054878,0.11724103286324539,0.81613174340321626,0.91102640169419347,0.660795213505736,0.21218788137046973,0.31087365948454315,0.84531518506801628,0.61045554106896005,0.46712703072416017,0.81234265060798194,0.48792136581239198,2.222657826263752E-2,0.19017747698769583,0.23833896844166069,0.34265961500949194,0.54260402773008531,0.78965756150614508,0.8246772370332851,0.69014288930418033,0.80963174322754261,0.40405944459995702,0.26817660974690993,0.36293505939042481,0.50133075329363241,0.19469562334974222,9.7926732732918742E-2,0.67141281266067843,0.34119455275318467,0.50341727311052964,0.70823160082898684,0.84240695965185208,0.88719645242033551,0.20441498513067402,0.57019749484261029,0.53669814165026242,1.384905402852088E-2,0.65305317058843626,0.75222230339481522,0.14484994558709552,0.67192765980939706,0.76976098089179046,4.2519173499072527E-2,0.79689618551807506,0.54379758904410691,0.79894027945404933,0.29752585260146058,0.70608774705008459,0.40081204773603962,0.66008849571652617,0.36734531393700798,0.93993480609932745,0.89432600467470891,0.50569747719534275,0.87287719261512164,0.11561832478389067,0.51253850560102332,0.69141697793220736,0.89777427179028868,7.6405872216608217E-2,0.8519824891958917,0.29392857462006883,0.31114409985313141,0.65234253177854218,0.70126780651373455,0.29503564820416117,0.42214008427340355,0.49347435198696799,0.55774854162495024,9.1717575864945333E-2,0.39721347331250023,4.1947042434382187E-2,7.3946574261427589E-3,0.13658937376889313,6.3985848287838376E-2,0.42743075294823374,0.26694197182922874,0.68494797707204846,0.76528978817541149,4.4061020146789587E-2,0.16938741244993372]
[1.9370271058079203E-2,0.23815257974147908,0.80872342765071348,0.78656055755157273,0.1109893424881776,0.77552050847415599,0.44352188868474196,0.10298808421393424,0.88236336236635171,0.87306617427641908,0.83649356776791417,0.68787387355670304,0.58452756992521515,0.36160840468129107,1.2659436010664327E-2,0.94129806610224265,0.32012627277910555,0.212558569203814,0.8599920841001113,0.44822563063838716,0.96092269801386365,0.47265539053552197,0.10437281204890692,0.12629997967821638,0.34629271212810708,8.207775169065612E-2,0.47310837979178944,0.74981142223220731,0.78048825841304514,0.8356127200429474,0.80850963545443399,0.51039684622425463,0.176918293236492,0.9329799511422231,0.35839593303968964,0.65954850854237568,0.15919378730569889,0.79367294645494735,0.44465582109120783,0.24673566817165637,0.57943296921897103,0.83645519250018163,0.17386246543404282,0.46600625228738202,5.6253727723113434E-3,0.32283622719311744,0.24779661920309937,0.56918293838952183,0.936307150547668,0.83412824326606894,0.68675782424769383,0.89425190736504234,0.82758084670171461,0.6517276288512901,0.47355724048778114,0.61898932395732931,0.35065181880709906,0.48721028772138664,0.43422657510407325,0.61140853524042171,0.44529063968146498,0.87631542138624308,0.67582862239653474,0.2881113160798725,0.87087073411794613,0.84540981382403924,0.8737418002201317,0.5992209855225985,0.83554664754924401,0.14674756469129557,0.86628742056662089,0.18197016664059829,0.12805927700298714,0.59515552009655626,0.16205405520256477,0.54280851373569217,0.95218438058663768,0.17057880268537728,0.77463135953444839,0.19773386599228415,0.75316273732557315,0.1139545942853043,0.45423203492326758,0.37855249413078307,0.27576785199816445,0.36140223591962295,0.14429713696128643,0.74659885467399612,0.83926227699675116,0.80512908694080398,0.67428977410859092,7.3292427445087127E-2,0.34452983850958674,0.92527763835223253,0.77810740103313913,0.20846053932913855,0.73895532535700703,0.55232201689767879,0.83802594155337662,0.84052894823810209]
[0.13765284871462646,0.78455948481060034,0.61394723973255882,0.34064456645202923,0.11843045514410555,0.5300208543205257,0.74567002910590541,9.6900236648246318E-3,0.55056073111614245,0.4597676585464987,0.9378996944828274,0.79206328059973041,0.7353545005042561,0.73113215382497065,0.86845905243391841,0.12431183053157813,0.29866104246806535,6.5205564205357835E-2,0.14481081076036595,0.20404416215268728,0.88872228019673405,0.89217919954646463,0.18185012071915763,1.469589164259999E-2,0.88526635705468804,0.49482715913953779,0.25084959315054933,0.63348205441614935,0.41531330525373222,0.75925107693225502,0.77927888682283619,0.9220477610809199,4.7195771292492861E-2,0.56096229091952299,0.47316056988282751,0.90285598175708792,2.8702489975787837E-2,0.61039904178528981,0.56226998883572687,0.71630160208092231,0.87465159416193361,0.56272339801429461,0.3361871648144138,0.99994292851888156,0.118594995348973,0.15380575946007591,0.22049329545585139,3.0285781500068776E-2,0.78166993998770506,0.32053380330550796,0.20214279684734815,0.56524179697143317,0.74783233175062569,0.87118904692757271,0.87997976661261712,0.52194686313558458,0.94434628197353609,7.6717193756085544E-2,0.84597009509178822,0.66163002432243689,8.9423907671742131E-2,4.6637422562087694E-2,0.69687318527680675,0.45301882751209321,0.72756244846107332,6.998253901136231E-2,0.93958474477991305,0.83988908233233206,0.43440948891241904,0.1708170792423509,0.40983479035581749,0.5499917406324728,0.82398369791893034,0.74349095931563036,0.42599966630413844,0.59492150451084669,0.95485720656129025,0.93434003624785977,0.53941852639279653,0.86933479489744658,0.70691964292844056,0.83342260777890853,0.76688086962709912,0.9145351598808602,0.63896379771537104,0.20168913554749202,0.60776306774116184,0.94530739943836228,0.23610288940089941,0.35917987974612686,0.32999325242721389,0.20590707837507893,1.5415041245172567E-2,2.6939573003335715E-2,0.805878440241793,0.5841880180074609,0.77447087680094728,0.96308812603869343,0.58984262626371331,0.31832126041825382]
[0.75705768605375223,0.62633216956941651,0.53303250226592569,0.98386739038149629,0.10662043380711217,0.762129987838156,0.19912962129567324,9.1562434191955644E-2,7.638946815265224E-2,5.6663729003446073E-2,0.28910372255413441,0.13210371056924541,0.49301175374253403,0.20272370655372562,0.20522004329807142,0.65801357178598174,0.21041821156751539,0.75444788890622727,0.75546055950290902,0.53825477299207314,0.49578165239259053,3.3298111552965137E-3,0.44243559610291039,0.76407130007630419,0.16157212184582181,0.48969761129259226,0.50207369629236354,0.14793153113977719,0.57028080734433828,0.6037664639821364,0.41614658528102388,0.6499274968147436,0.639608078619469,0.85189567739254024,0.22533760032031935,0.55825831123395009,0.75628832183228201,0.19607283764691386,0.56867406302968471,0.75612600352604642,0.31626335067571876,0.41633402025805311,0.67810176772869257,0.73302762306272795,0.57070759359045431,0.82558352249396749,0.85362560542530763,0.52691801397542248,0.15096903739279588,0.96656328069518793,0.38206567952819848,8.5188328165908267E-2,0.43517408407014724,0.72147062065782086,0.21319255499243894,0.41102826737528397,4.4369461594714332E-2,9.8672640111113874E-2,0.65673966556578922,0.51263149628087268,0.23413912116056368,0.94143816015365889,0.81322582098290053,0.16184357254276305,0.62921685922424275,0.22038746569031709,0.73279998049623885,0.95914138741233357,0.59341254544558919,0.82130489120989048,0.86264072431293382,0.13152504979773383,0.65665860040932289,0.30694261690505409,4.9769654796498752E-2,0.97887694013828097,0.440363036717213,0.67574923739744275,0.39419791225643641,0.53855219901942941,0.68212228516536655,0.56444969682896395,0.64661762284104773,0.94775686527666958,0.71361322122988213,0.48701860704865485,5.2748556275658887E-2,0.21516133210025101,2.2908289808218463E-2,0.16030701000272696,0.21773482492228768,0.44090369528647577,0.90734146034770335,0.91664763625418511,0.59564120873824677,0.46677256144169843,0.29910639599959044,0.3118660123098731,0.23949060782828524,0.17672098527721014]
[0.98628818063951951,0.33123978590147685,0.53062957931060339,0.93269693831794964,0.79818365072439657,0.7175848118575856,0.96485676372279139,6.8981254212985288E-4,0.50163503013055111,0.99677492731820783,0.67909671425292784,0.82553556595436317,0.7914821408354703,0.67055963274348296,0.3966256187363818,0.7714312256204171,0.49280873642696843,0.66604345323800918,0.90974527982838693,3.2811199235419863E-2,0.87689266247163855,0.44767400080640274,0.9978462761768716,0.85754781443902173,0.79262465510975022,0.63703928098869522,0.74976271333296518,0.29344728964394051,6.7766091755794622E-2,0.30674769922020817,0.41278594419123882,0.63651359972748811,0.14348267521668367,0.63695675311433431,0.13073338472152152,0.52665755097963118,0.35429913788758549,0.30720805799881279,0.5107417260189363,0.3050015302558321,0.30407293384112366,0.32638486957129365,0.78860043256407231,0.2483740554141588,0.97602710153622596,0.53935718278683886,0.13096237348207151,0.57306229248389939,0.93922959148481278,0.42511774691872284,0.80582356608975503,0.88566849028354278,0.26419081611396433,0.45706941417154745,0.20861545677628013,0.60740715621087193,0.27249430466431446,0.45884646442721355,0.3849436985314193,0.81029915717838075,4.5908890839166716E-2,0.57929134444586849,0.84787548657399547,0.99165026770501696,0.65556571217539072,0.54841889516758646,0.13131690366771087,1.0258411298517123E-2,0.61607670256639513,0.92172049985754489,0.19891708371491312,0.93038439300690701,0.70856011250215267,0.25110774830384153,0.91216640423223039,0.72447866741734512,3.9464075858391623E-2,0.4857727155102094,0.60398998753279165,0.82883535127557817,2.1009201334217353E-2,0.5884917629281593,6.985404268759976E-2,0.78467255224709842,0.86550032453849779,5.641749085883907E-2,0.12581860697104064,0.82835786414965584,0.2118569613284047,0.5474328863304545,0.56709378220453777,0.50987083803528399,0.48253677403928363,0.20280959034787605,0.75499553099165007,0.54340264497000479,0.93166158532020926,0.12595779363399318,0.44360800433746683,0.49171982725811925]
[0.85054033114486716,0.3167215827033828,0.89788025396353977,0.75498285401952459,5.7873358233151428E-4,0.45677691522963537,0.46534281018219614,0.15145180480672282,0.14863667908216338,0.10716164205870304,0.96981819811663805,0.62439189379431326,0.67556197255858463,0.36712564772397038,0.29808969053683898,0.5392252581803314,0.28573468645923084,0.91960441216337585,0.23034647782630224,0.97549871494785778,0.79025682049080537,0.7330932692923432,0.66205235405356466,0.51635685014863397,0.84548494456257695,0.50740459087336942,0.78729024314944773,0.53466733054606885,0.60153162202495691,0.21060725589266527,0.86165183531627609,0.80419178854247786,0.52805711104918396,0.30243116187060015,0.55366393901809596,0.91870372829405511,0.56934258661464521,0.2443319978200329,0.29444631568480129,0.35142436465515547,3.1332083155270141E-2,0.62669504056306469,0.18536655824044479,0.5705227130278574,0.92758351506446746,0.35312424948205778,0.95876186676342434,0.21522657328637551,0.20920978949045688,0.62740331252964687,0.9634285373960545,0.81640030762171689,9.5061296932789086E-3,0.25973947371571249,0.87068447975419805,0.35373510515933293,0.18039637091510785,0.97542383594239457,0.65125396014954939,0.8451837452068709,0.42932048993234351,0.82801227961148716,0.28219351068225595,0.81076468420425929,0.16439256898788335,0.44820199285430196,0.3451387627833975,0.84105068605620981,0.84998634154035435,0.23765197813598704,0.32721667248807285,0.22504269177404623,0.48691316045211552,0.55506384992185265,0.14712712363101021,0.7546186275886112,0.18363470884799171,0.54512168187420651,0.11200995837841377,0.82328392975653042,0.59205151210096285,0.61976823439224193,0.70034814315309257,0.9099365937222198,3.2965357744539903E-2,0.61218799709218685,0.92299488686689546,1.911275731071238E-2,0.16625095730080441,4.4930957528630966E-2,0.74308953108863673,0.80294384028481247,0.83000135766439453,0.24236560760285453,4.0423648402691081E-2,0.57162429972500839,0.44704106503814123,0.45020789664494909,0.96036529538048632,0.35056972960967314]
[0.62560074844289548,0.10797549977674803,1.3101337992777129E-2,0.90760221584089706,0.50900523412199583,2.685950872298315E-2,0.68297632745933867,0.6874742359767847,0.87289770254159749,0.5108422238205711,0.97250272971976914,0.73431085550609387,1.7532062073654875E-2,0.63761439305336753,0.39007398855952291,0.76210925362693072,0.53373117406768589,0.71015150819025563,0.59886724172993488,0.1557030158339604,0.54501075575974345,0.60669107308585346,0.57757747858859843,0.30684293812203101,0.11300330012615489,0.3535088965495774,0.83386408638806553,0.20412745537144883,0.9147037638862211,0.77022036583433295,9.105980952966275E-2,0.52118886271445097,0.23149553020366309,0.82905805901423379,0.66591868509154495,0.38889229042212659,0.63386376027972369,6.8034800877014301E-2,0.98164085521304889,0.83446533738404449,0.63606276371800652,0.625255022970999,0.88402723361160918,0.69066304661363653,0.62845780738259394,0.48220024647443505,0.34489239178080189,0.46804245804406663,2.0535693465572824E-2,0.44811078279605088,0.39660658287204342,0.92206151492800759,0.70903442354823099,0.10713082180961531,0.86576023409782765,0.6275800195601392,0.21459671333661223,0.97459176262233105,0.56012535041518119,0.70164986793359652,0.52958509846319424,0.10882203769688514,0.16806965871681678,0.88592552453934159,0.1245888638406677,0.13891703327654159,0.41680725194999257,0.17107144462768475,0.31571602752562389,0.28151894846897574,0.83976374015640998,0.8091308796653085,0.73826553431620745,0.60641937249223343,0.93603555194479537,0.94044733425106675,0.8194385914147968,0.72230286608409489,0.951625593471632,0.19812845915002619,0.56493377309857962,0.43807783033257408,0.52018907363328615,0.88989443350389275,0.13711952543067318,0.38100535745372544,0.2459400100567638,4.6937758219741332E-2,0.56619820400476417,0.15829576235197296,0.19741770921183266,0.86312620345387125,1.7504666175288786E-2,5.3341968501784742E-2,0.63205263255539068,0.66679756078494945,0.1123033686881042,0.81835595467126054,0.68399704365482594,0.17257527937923267]
[0.48713174019316585,0.74109237132160488,0.71245701730165301,0.11148076548541141,0.36772222100561247,3.9435853838712509E-2,9.0012607144716039E-2,0.92697503177230989,0.6317228905757577,0.7193217288211653,1.8828397522387963E-3,0.28928265105438722,8.2142364218451003E-2,0.2699985333445678,0.82473039114834767,0.53290473558184404,2.6904994997953402E-2,0.91272553047075389,4.6222832354317123E-2,0.62435770216972719,0.31879894901066808,0.85313503157026938,1.0782628920810278E-2,0.43644068192243146,0.86402418347128884,0.6398743680712905,0.56325453349098265,0.19399971612899658,5.37889001534545E-2,0.33766023671228507,3.4106731084755482E-2,0.44967769451431461,0.14390401802779462,0.87030708041811611,0.31791468383881183,0.83600915667621967,0.73944700014845555,0.9480996298375407,1.4244768071784986E-2,0.46869347688262963,0.51905867933806726,0.65019841552724444,0.24000555527904266,0.59665072023231158,8.2260728211923428E-2,0.44853917218537942,0.61123838224554794,0.25786536467302568,0.89178164993284559,0.29548313348093413,0.18123492510637162,0.53824507242758979,0.33594169705226751,0.37885930655399824,0.67597506098424576,0.56769457784068056,0.82811628793145742,0.60320591935935075,0.35685815566675194,0.48085451835634097,0.34916228179339692,0.5104484488151626,0.56805826916566815,0.21063233350375532,0.30248426162887643,0.76964018864131456,0.71343011289568137,0.90243069146815824,4.8787199609239162E-2,0.70166123239034983,0.32959477844118457,0.75127439523011763,0.46460676596672634,0.3400474057120404,2.9433200100322909E-2,7.6065156208609319E-2,0.89162235528014078,0.87620213974647421,0.47950576363095077,0.73858644686187436,0.38175540144198994,0.41411629927688309,0.71723911510592409,0.31456540323616433,0.69832486702075058,0.59125511898533167,0.874717515260232,0.40462140981692973,0.21849454092535303,0.28877362146137309,0.56802248176657788,0.90582751770058267,0.91690779857354365,2.3446982410394779E-2,0.55729846041616748,0.73023602493995576,0.98895313706069876,0.56724493003456911,0.1119019107656245,3.8032763624397004E-2]
[0.30588368664956533,0.33879474379035113,0.59156485457580865,0.63420754390277012,0.94932910979862462,0.60153678964236079,2.3185996563919398E-2,0.51346329444728911,0.74456854318120258,0.28816881867688593,0.12594054036466129,0.63139175060247144,0.22455475274703918,0.8543405860065747,0.3292605440316948,0.6844131194291091,0.926572389608741,0.15083376236681278,0.92533669040886346,0.12564526346778915,0.33468238999209154,0.21655253654826767,0.13087872027274872,0.48653692048962682,0.7997837771114088,0.99717027650090717,0.41231144798422514,0.95167887144993601,0.95899712774811963,0.65841890010520954,0.62701049452103153,5.6869178488745509E-2,0.41991400676756585,0.60469228093265215,0.70479457698171688,0.25762812716651606,0.62325390962503358,0.45308307782761192,4.0321072476866116E-2,0.4525516720803261,0.46712589767396639,0.54036693572021,0.54258540967053714,0.23502900497118584,7.364848059383533E-4,0.82236439537160533,0.77183403759492497,0.62513294963464949,2.7335083473327693E-3,0.67691396161344208,0.83509041644483684,0.97642287978470299,0.36293309265787077,6.6267603222746052E-2,0.96772335290030354,0.70745955344911071,0.97646798021595771,0.65306560909470435,0.89587299659489017,0.57608288469489521,0.10267401860692682,0.89595898969638099,0.39130328123361624,0.34874678113543511,0.99456517235722752,0.18972770418133311,0.13473324068481751,0.97675819995863333,0.48788454792371472,0.73304446654049737,0.5982753656078198,0.61884549018097124,0.34776423671096757,0.26532476863577137,0.25066637627904143,0.18220865877772652,0.50548575772401383,0.79269575442411466,0.12875012040270528,0.38415088980038092,4.9038641071540212E-2,0.83819358623551843,0.57724271181324649,0.80415137485513288,0.54656757515698373,0.34516376838007423,3.6835483744533937E-3,9.0912169568483026E-2,0.75642808374566306,1.029611851530654E-2,0.67167739634487877,0.80551922459473235,0.62434684881998292,6.2996423166617577E-2,0.51372160942277112,0.58708805932078623,4.845744680648123E-2,0.63019462336247012,0.37655405351953852,0.97008758341807255]
[0.36352227546514282,0.61339809175475102,0.58318444504572231,0.73808399123039048,0.51583327156367165,2.5670272341783429E-3,2.1444141916518E-2,0.3717049067148176,0.39462475548860954,0.49681705058552195,1.0884739684317357E-2,3.4445081071839301E-2,0.33958334008144775,0.61107095782560183,0.29449137051631469,0.45511028029214717,0.44479726717575663,0.84006837979547366,0.14681862399934875,0.104584779595712,4.5509630460901618E-2,0.67265488745005242,0.99694103939302792,0.93632677450648294,0.38786095796906195,0.18272049111485988,0.50285176349601268,0.7609198839536645,0.66613513547999137,0.37443539993175323,0.63679492107431834,0.35042851016474008,0.89723478933101153,0.59396811714137188,0.24133350795577846,0.74077120990695733,0.29132464690047744,0.34743702386413788,0.69890143705965979,0.87591309951625274,0.9097635766863843,0.98970301586126752,0.62411686385710197,0.53289441754002809,0.25423323331854142,0.8092201144166935,0.50427562457585851,0.67239989026051683,0.21152762339286291,0.51305663338735641,0.57792293041817844,0.1341277805716512,0.34717268322653871,0.25656360860155902,0.51783378120079282,0.69038962204583643,0.59462811031616924,0.97253134450669554,0.9404955348351135,0.7159125946259689,0.54843764347652613,0.80327376401425354,0.67315844050357154,0.81614637086949504,0.24213470927278335,0.22390575099356669,0.70994347723196438,0.48231721668795025,0.82538191093243618,0.52909451434058874,0.28381793855768189,2.2018999490389546E-2,0.60443645065968687,0.91666310310095789,0.87739841707000821,0.18808116784894635,0.33503896373911235,0.40928558195655607,0.51850161714595344,0.51228924756826444,0.64781340733125525,0.33412022578297029,0.73519977335652176,0.286031793153813,0.75301996803600735,0.33045335121686847,0.24780503344167171,0.56210216522128043,0.51225620243370684,0.3747366918788213,0.84739928435527567,0.38989419282588333,0.87773375103071494,0.57482488166531098,0.75449843805580596,0.91745134383619664,0.2390180064882258,0.83989555383186909,0.65601513789807375,0.27516865081848252]
[0.16992071435783296,0.84478246678186542,0.4144492989330274,0.64158013687340132,0.24035198630642096,0.77025791990611103,0.33813041851879955,0.29051253386211084,0.1975960400590282,0.35608177276067787,6.9918442363737898E-2,0.16479723371956279,0.17195344738367246,0.93700809234970661,0.68467073325055217,0.74139174771792093,0.31699771667826737,0.59922512121730465,0.94527910057644493,0.99393050309958209,0.16329445681767507,0.52996965030139875,0.64286126016476131,0.74769730876347773,0.82741315364517387,0.45254709855286346,0.13464450384074178,0.7294328352742292,0.67084892103503424,0.44883394837061796,0.94664541650980438,0.30615165210530471,0.49390904318267859,0.13739892756078087,0.65377405768504271,0.38537036037102979,4.4677402027518687E-2,0.36310977486758533,0.19598217431825948,0.93485917163173671,0.78627264775227501,6.3959265562899659E-2,0.76219853930421899,0.10568275537107197,0.53556939474205323,0.134808098109236,0.89781041685921403,0.96311456774282711,0.48682319837378329,0.89350539087777603,0.36113608918838391,0.13745936263755132,0.49203676400192742,0.6480315550076865,0.15016034719611249,0.95923631354947758,0.97675401552241337,0.35805338600162095,0.62578200455004185,0.19028774214868394,0.1147996666874328,0.38344176625019,0.67898934823017121,0.66272283618755978,0.41456835721193896,0.73602418040512996,0.34829800867019645,0.71706112627825691,0.56189588449393091,0.30700510370898304,9.8172650134323858E-2,0.79813733510864848,0.87437606889464292,0.66898268709148156,0.67376177062424347,0.12426559851307772,0.86896963966854279,0.99792475270145442,0.15640964657540601,0.36617660504897509,0.68986761500929972,0.73069120694507861,0.11697096449351629,0.91104647087231339,0.47036716198343365,1.9041825270744828E-2,0.57890984604707652,0.46058328856658193,0.71628428570214309,0.83987047456170727,0.21389656190781192,0.8817789836283888,0.7826407421445607,0.98205615693778969,0.97547746630849808,0.399079013195618,0.31078552133385506,0.71586914225764786,0.68995255468242378,0.13600055403552247]
[0.68532370186115577,0.11417135629642272,0.31291673130777198,0.95974884063467114,0.96379936786388498,0.2039783055633182,0.74370909296889498,6.4863525987738146E-2,8.011179345752284E-2,0.63982814021241252,0.67152378520252032,0.74577766208797625,7.7399077841297736E-2,0.67580286575226978,0.64189343284360234,0.91847328533007544,0.41296405836885786,0.24869137515884898,0.19342146544732153,0.4488063282876078,0.24194769614400913,0.97308891241636086,0.10745192358055156,0.45392861299230658,0.22432416774609787,0.53557166892578878,0.14686040472724216,0.75067372010041722,0.16945985104022199,7.8000923852567738E-2,0.50964858696840776,0.97284064052070929,0.4223824039375601,0.4608051677922318,0.58702187550017249,0.60665303666244086,0.21840962076688819,6.5995573010131481E-2,0.12061797236860761,0.37464584663509581,0.77522902273429783,6.2815916901545976E-2,0.22066324887816391,0.57894635437932107,0.85406032673922327,0.63591816391889311,7.8664232860951588E-2,0.80488209503699515,0.5687787587026315,0.8707556933931534,5.7486762330206109E-2,0.81979103972250333,4.1247916408239549E-2,2.6572909105070708E-2,0.65688407112149694,0.90149276422331193,7.9681451713638052E-2,0.41517491853365029,0.41467179301672807,0.41204020926356855,4.1688070672925015E-3,0.44574788093367834,0.19534903548052307,0.48156381506598378,0.1838321475025565,0.56489564601500508,0.29190997219698223,0.44914201914270435,0.20964940201643356,2.8793502560654827E-2,0.36947858264722533,7.5328867714127501E-2,0.32467027018012573,0.32562885289363686,0.16869060211764841,0.34355521920327092,0.51604989368417631,0.51716020200302493,0.33342040096701397,0.24436267388324795,0.24808195080167583,0.68617227420546889,0.97690940509151147,0.88438457651887437,0.85909637278847484,0.47203282520068213,0.92370670450822068,0.54746265392714055,0.24215400264684517,0.62185485949338515,0.37621727993759013,0.20615559454648502,0.35249273775674472,0.22130225202494425,0.15632097990722071,0.66651976582095962,0.438136640623766,0.56581002324647478,0.93204448769588311,0.37555486096100177]
[0.99784541215600719,0.18683974931925484,2.7417711609311057E-3,0.97653871054252395,0.12646091240519142,0.52078221212337961,0.46177110073684613,2.6719598634553532E-2,0.60577398903926505,0.35824640896646831,0.26675520858548363,0.18216267314053536,0.89401349240562178,0.4244498877854963,0.89699279878852911,0.78544707927863922,0.40483899857321926,0.21394681632661261,0.2907259110756546,0.93565524059597682,0.31291509183352373,0.25952580470370756,8.7568749939765156E-2,0.80592790168097272,0.95165279888763599,0.30892676630461591,0.25752531904951204,0.60281114314508744,0.92426172900670178,0.8449078607487801,0.78338652859676883,0.99689471142450747,0.65251192161406957,0.60581885359453702,0.7056738806454721,0.96794009748958387,0.67194096840732187,8.5013319661108255E-2,0.60238876252380635,0.71203722929060753,0.19413892443826131,0.64956646031340193,7.2591886393120642E-2,0.67857524126316027,0.48540259292545329,0.61619202038920895,0.54838830535834993,0.12454331038617728,0.67118377097887461,0.46721044042162274,9.7126711555729606E-2,0.98242069774861396,0.1977260189383776,0.68207324079915921,0.62701518740875462,1.5449169606288948E-2,0.75140162698516622,0.46360523221254224,0.73138450049190074,6.271999491756941E-3,0.84675106951935664,0.78746905860538097,0.97465537994521412,3.9983455268678969E-2,0.69100659571714229,0.38643625591033848,0.81427188236074222,0.45826999278886882,0.137378584597736,8.11286173788619E-2,0.7678812484308476,0.47480177100082277,0.17368645768320312,0.44627685535373052,0.10748392459016243,0.94128480420810934,0.63863839684405699,0.84123906545766136,0.70469264180534374,0.216310884367797,0.9999482553541198,0.33445122524956339,0.66516960686998661,0.21774845954287714,0.10002237277621551,0.56732814801791298,0.98173625986069601,0.79657162233573198,0.86670044872490981,9.360435085265062E-2,0.56964298169906236,0.84259251983983474,0.31961720824317141,0.33042345122644201,0.76916545383639789,0.33165304695121656,0.47515750060125417,0.54496861379838202,0.26618050331641374,0.417666692204958]
[0.92514003715128479,0.79811094283085859,9.9924802004339064E-2,0.37016915125192151,0.49475634773592436,0.16165934078275157,0.96920018580336065,0.57966621830535547,6.0116878744993163E-2,2.8286791630740327E-2,0.84351175586894422,0.68014657318674754,0.85384950541701365,3.303044081985651E-2,7.0233069418480398E-2,0.97595637501577737,0.86812647897363771,0.62363946982621854,0.68951610873415559,0.60061448821504293,0.85930280252306235,0.67409089096862274,0.2605449737093084,0.83322698499421699,0.89019733768361631,0.4525813829261911,0.7774608096685216,0.54322751944301673,0.82037996485391596,0.64035599824412603,0.57252904942894078,0.87302830359445904,0.28875405483752581,0.86728405033047506,0.46888513169006407,7.6630198871264765E-3,0.136401126166383,0.3078462883033416,0.59374670516319017,0.8612687283828433,0.94473210479727165,0.47291478958924682,0.61295673164837516,0.88835823564084349,0.6371790815063253,0.87154663763630746,0.43290820997251478,0.81414257751735519,0.86398194912743997,0.80576705416265726,5.0725608676988942E-2,0.48562651074200436,0.53227739529253637,0.54173762362454392,0.62260651811408685,0.78211491396222721,0.78578650429783758,0.34890867224999256,0.19452632630351985,0.75956808603195602,0.65194613447681571,0.13031196508718423,0.59217389818646926,0.81841053889688964,0.79494051677671618,0.48808775434466145,0.23295083598666788,0.98990087764603296,0.54506836742418541,0.67139718337680987,0.69537810291820479,0.54557063986662513,0.23397753558810841,0.35156972677436227,0.43580020667591013,0.35431115672744751,0.52782985116810355,0.4548882081926473,0.57012171910355003,0.99742571777398348,0.85030840679990716,6.9205883191608919E-2,0.7281746047118075,0.60479711574460215,0.95699416972197582,0.65722192084100783,0.7907455553243623,5.4331153168211244E-2,0.74087344935259625,0.31230388256119346,0.20501662858712144,0.87479999449697332,0.44257465336698631,0.90860319723577287,0.41863982415793921,0.74124237182450992,0.767994807080015,0.72144676923525386,0.13239571107446324,0.33524987565300146]
[0.17796897275906076,0.70120070934918122,0.65567130480261759,0.73156431812077127,0.89162459335798139,0.81994766190333557,6.0667950092417433E-2,0.80025690761141299,0.87353846998220464,0.61115257454783201,0.95431942809106318,0.70442429594124256,0.12417642970754184,8.2711474635947524E-2,0.35769706019498049,0.95278659221578343,0.63295862644035583,1.2233798105716343E-2,0.47703820406552999,0.97993226385592258,8.3966345225882977E-2,0.92287883552247585,0.89379474226459399,0.9390340862192833,0.35947588318687196,0.72842232891990122,0.33148032036158903,0.88223447757869433,0.90202795775150701,2.1944584633289632E-2,0.28991998632127902,0.8464803908491102,0.96369107316441249,0.21158575618388831,0.12607982034431575,0.81158130935084849,0.401213353515953,0.54557424499926388,0.84526792166975229,2.8824663085179059E-2,3.8235422748052805E-2,0.41908136444088406,0.69001751669142142,9.6364928454735765E-2,0.40761399810523713,0.25879038695015433,0.51957194394503992,0.37531776957168439,0.72298235038092185,0.75063564393445237,0.78741766424872206,0.48731355658320097,0.35742463465973084,0.59714682848889666,0.98365591453974022,0.85437435967655795,0.31481419578414893,0.71304709235509056,0.7527522484435295,0.50840424656973693,0.81818905207609027,0.63561239041664297,0.53147242988021215,0.36405184137315671,0.19033405421573457,0.41023962230592936,0.88388311356356475,0.89201536879111931,9.8553262120657736E-2,0.90758932524996894,0.59253108572877489,0.36901428375746037,9.2379565908962347E-2,0.97796423036196867,0.45508037994060302,0.81928846594181326,0.74284881914462664,0.83396958224965634,0.98091250416568898,0.63477377014282588,8.8787401305827851E-2,2.2307680214183279E-2,0.57051959399803731,0.65073116234969963,0.10545811101732894,0.78884563858070966,0.31081796853017385,0.73839109759813082,0.47576539486073899,0.81476407281864682,0.37854401068445276,0.61576870142015605,0.41158424624918855,0.1528779269250844,0.6662413370108563,0.29981219926914804,0.77894072345628884,7.5803549519915525E-2,3.6481085642399158E-2,0.89649018548054238]
[0.44096598530767506,0.13334230549202875,0.71614471031483129,7.6413128016886933E-2,0.97286543502305167,0.99644278015326826,0.54754447877084511,0.65166832391519935,0.37578041607160118,0.72428159954563476,3.1583058755183857E-2,0.68422671822623182,0.59814743582518082,0.341846405306097,1.4279012106597433E-2,0.76168991859589463,5.9848462814917402E-2,0.47511336874213339,0.52866271358180161,0.56160013363857508,0.71154688651381914,0.63769357920702363,7.4849027545505042E-2,1.8575492081652323E-2,0.3865349942061056,0.98378670488092756,0.78192975234274364,0.78262676561122257,0.95946137466794379,0.7576659930637264,0.14890139655792856,4.8096970981359011E-2,0.82134523473839227,3.2200133457589653E-2,0.47828441727119997,0.66774306458306809,2.8794091533917765E-2,0.11717089849316809,0.69099702463449353,0.74818137759347514,0.12214215911702331,0.60913992420804519,0.46494845821479425,0.34901863995716587,9.8321681296056007E-2,0.23487110226163754,0.19184191888562596,0.90803804349544381,0.8181297605317106,0.88748753668728364,0.37415042296098056,0.87054004503672089,6.9835065306788846E-2,0.91922924260955141,0.15251800573726693,0.58207965719945365,0.67298433319277307,0.15342874860937505,0.53942511081065136,0.44306665483450902,0.720812938679811,0.38109529691110788,0.10696338653185289,0.91756327191993003,0.9849521915112841,0.77058063732513615,0.16214194454293562,0.37463376957345507,0.85306819493269737,0.51017259529355274,0.45772152097674612,0.15538699032940995,0.8962484176160963,0.15306295540010351,0.56116716068966188,0.66520769517767653,0.27670523048034756,0.88673634403071877,0.99576366649366121,0.83258246453425744,0.93842027909603698,0.97492739750215973,0.12211252542503448,0.5905344148973436,0.13355651597093021,0.61460608904015412,0.61224850478527693,0.52361154056347081,0.30076243003988368,0.50367706814686419,8.4137053890014135E-2,0.30890271799016567,0.75097986117060755,0.94131140557296966,0.97020053917046101,0.77282664119390077,0.21045920218036995,0.96792761463996435,0.90201213795137392,0.32436978711705045]
[0.54399423837949801,0.25911755150402516,0.20972773441326265,0.50711658436189633,0.84080054291326045,4.7212427819493086E-2,0.79061805864218415,0.658615947444393,0.74510641022737989,0.10240937988754817,0.69806849251362091,0.17726814153871617,0.1987757262568397,0.61141026888224392,0.76928507644268818,0.68585795479116607,0.31936721501516141,5.8586506593579779E-2,0.38310936063278989,0.89188037434660872,0.74993028143740681,1.7533215209387776E-2,0.22727675773122369,0.53261315107856588,3.005224182191657E-2,0.45834416201676653,8.8414281990301991E-2,0.96514105466643796,0.4403612944703672,0.41988083511816221,0.84146116193354403,0.69620463436599023,0.66977655120165347,0.38215943209981773,0.62474382759970504,0.53553810671300128,0.77164902092809962,3.9069711753651593E-2,0.465849169088841,0.31567500935142423,0.24734033598448135,0.56871454084726802,0.34893818232752605,1.0123660427630354E-2,0.700757680400655,0.11289754231689997,0.59142443685979995,0.56818297927558825,0.35908992784434035,0.73398421670354697,0.44696018508453006,1.9734149429447179E-2,0.87848082549690765,0.70776351409758609,0.76465657767999817,0.83506550090975573,0.78581574135797949,0.21200236963424601,0.21510815850474174,0.56268045372878162,0.88659863538943562,0.78861769260143499,2.2074363710677947E-3,0.38076801689653206,0.45831865066663513,0.60263560500267521,0.615414955574347,0.15696241233157771,5.7092294255627229E-2,4.1569081552286447E-2,0.84627499142881457,0.41677742451132116,0.73268033449085856,1.0396001743848471E-2,9.8903399056679331E-2,0.36671504236634322,0.38823857955294017,7.736003770728761E-2,0.49686513953551015,0.68414857637572113,7.1683808490253353E-2,0.23483752451119533,0.7435800670558288,0.56564542708870602,0.98285924200978303,0.64893673601066026,0.49905340875065274,0.72450506377632062,0.76934272770347356,0.60007624429389916,0.91167995391654988,0.41646432732914485,0.72319947120257189,5.2128062197815073E-2,6.8151892225381761E-2,1.2837050493678004E-2,0.75975743260281037,0.28538342128449379,0.44147988204452249,0.93607860499927509]
[0.98502287785454545,0.3005645451980572,0.35222742130899332,5.7831132939957675E-2,0.35969409505186511,0.75120185251145011,0.95749817120959424,0.34363278851570678,0.26498754360345367,0.2935150125508228,0.35959837960066932,0.61737778735708715,0.18198287585912365,0.58843062234267485,0.10823935000970764,0.85907990026540648,0.17573468084893507,0.90971037420281753,5.1469950752120575E-2,0.8407611665350182,0.87531007687456308,0.2766343789998269,0.30423474185921739,0.93237589008387334,0.65544557982702301,0.61002246532814342,0.32849469048966129,0.37242902538915046,1.4676849982273477E-2,0.50577993868986415,0.55165215847429416,0.38657792942514535,0.78468822459598864,0.28907066284582572,3.683177194177456E-2,0.49227677026962902,0.19558911880667607,0.12908406116848326,0.45790768002530458,0.44840178080118642,4.5149335399707113E-2,0.46723155963295748,0.12815646599491359,0.19791063481334104,0.66168274793212845,0.17841327287122277,0.73962947609128726,0.31462014542240013,0.26066154792537333,0.45394694200282715,0.10950419159395808,0.57198663505075276,0.72990634468418902,0.78356346026980972,0.82665472499024184,0.29270839206883792,0.39944794838085362,0.30115723536745564,0.41102385010500153,0.62740491633057272,0.21351225293553666,0.57223493585241492,0.56705344361902421,0.50846245474040874,0.76440159753610215,0.40437936034619537,0.72365990808158687,0.60607147734228561,0.54348739758284059,1.0190421135073846E-2,9.3472243064904315E-2,0.72388449618410033,0.83181236298884231,0.85019419623778125,0.34849168032493294,0.81550443795476479,0.41543967302465412,0.14724961084330579,0.32363617966202329,0.95526290532986535,8.8105335429957798E-2,0.5569966281613663,0.32796255379751482,0.78767993771594258,0.21555821205616987,0.5574835400358612,0.31429690804646693,0.44388060260007844,0.47606245015800552,0.95447989226347474,0.94870057097219562,7.9016991091105826E-2,0.54789246795965751,0.85411106720870311,0.72576023821307234,0.36665408940467881,0.21339775676258532,0.66162921480967574,0.74973272168355254,0.51503968770924624]
[0.65982124670227782,0.76058683212687372,0.87089597514113215,0.62117337751670532,0.76971406846409729,0.1362424227375485,0.82851339549948733,0.47604442705408123,0.58267484278793025,0.17500594162986638,0.75148856057169311,0.89735026214765679,0.75974497786240713,2.2967005039721267E-3,0.37109230360072942,0.52812488334651297,0.45339940729119244,0.27892567637815113,0.83369003317380552,0.40711153525200583,0.89312007469752797,0.58413305435871377,0.97834755907259718,0.19108218015327982,0.12998613677717263,3.6102666600540623E-2,0.90991799129657402,0.95561504370911321,0.85573820116362942,0.21778816480346186,0.53959742212933626,0.39539414942194762,0.50032678904975725,0.68494847873608666,0.55569340958620872,0.49362905234768861,3.3795843261008152E-2,0.41075008344703723,0.69839481774815859,0.67525225796984434,0.79869249861683589,0.8490970541773708,0.47143160332761624,0.35977492208962814,0.90393795069055671,0.26048776499677895,0.50947452131182291,0.29471446816078684,5.4919819602107234E-3,0.97980279816534976,0.53790954573650096,0.19257134882986682,0.90396990888375661,0.59234072678781602,0.23701709360294765,0.91637853992651774,0.46364401039365466,0.13665853748521684,0.80021541242083971,0.62478423186981502,0.53549588421926964,0.13308709082967463,0.5368957101230154,0.8741906025551206,0.96146829260344457,0.31929888570955534,0.85130788409196656,0.36598570293791277,0.1197923133885942,0.13258974418545222,0.23917706685521223,0.43886206052795096,0.98238892514323839,0.7756343648813433,0.95001558321153523,0.41126848868925825,0.57526344498174464,0.10575038356094391,0.47651926271852751,0.11924968283370374,0.66116047199551664,0.42859996187661653,0.95024736877732319,0.74632030818537576,0.72165175397398773,0.6648609352802084,0.92508705826365767,0.64991509316198681,0.64453527140740441,0.98439036655081413,0.86398830493816181,0.49988815286424282,0.485185540132968,0.76037014791281687,0.70780777871181877,3.5946918026721342E-2,0.74724881274583943,0.53753799877500319,0.39124076452867651,0.1148788663801491]
[0.18599441642119108,0.30326706381586088,0.2081274753772383,0.63964969259400162,0.73392469797041504,0.60726305362641075,0.28818782911819285,0.57598600487026108,5.731968452925118E-2,0.62496677165187775,0.12463424193517003,0.79052240445585542,0.16308753986632529,0.32659003287569532,0.38256211469564194,0.20366497825896634,0.75808208972063185,0.20779117761084809,0.87395422263217326,0.94229448536758176,2.526176335196828E-2,0.96594014454044819,0.59173709727389412,0.71300617551705969,3.1678112137650594E-2,0.62805804898357009,0.78652700789364083,0.99992773204441598,0.80310801712109425,0.39346740099263877,0.39933147968442795,0.14348823909000097,0.59373893619462237,0.11046486909041053,0.20876702754839205,0.74667493661945894,0.39642095942266031,0.18113679463662258,0.53173741085817339,0.52621277720972082,0.71008609428476754,0.63248408463584671,0.24577221877066446,0.26140072934343728,0.18353661004499,0.99633264744206818,0.19875368626209067,0.5240648913865309,0.81706890543624555,0.22244121395782479,0.3344637656893199,0.35432083472116072,0.66118142077643638,7.0363436099975418E-2,0.85459645311021415,0.77647446961702249,0.37069696001087393,0.45399488042944647,0.42298754879336742,0.50352266957350011,0.26732583927635079,0.80295860703608424,0.66579111224832765,0.56033944332740493,0.26527784644881813,0.53225446176830871,0.13024105797979213,0.39910211810079843,0.37309812793575003,0.36501295135893252,0.38406657365737351,0.18630817484770645,0.8445073142953039,0.11730283894897398,0.46532090490193789,0.30559325982741803,0.60785213058752607,0.61457450155144311,7.3109994106734133E-2,0.80386974813729828,3.9495567607296667E-2,0.47758600448500954,0.4857059795466292,0.78978432969093693,0.41391069018017401,3.8113361276618241E-2,0.13010770240499814,0.90331434243432063,0.55709830229572788,3.1762692547742888E-2,0.10765198680361099,0.44854703745189384,0.76688927514000571,0.35607556283885444,0.63779698297360721,0.37321104730186738,0.30096735175942724,0.56695939260169226,0.49960403066742776,0.45623517421464244]
[0.21993717538392688,0.94720836461771563,0.22028608028328789,0.41729475289515527,0.51615267801824349,0.20300023545785839,0.27150142617539486,0.20526240801614037,0.44963974940062412,0.23017981205352878,0.7858151911833966,0.10121655903431104,0.70099234088615747,0.57852163930791933,0.63842736831151425,0.36488811812402699,0.44740792033752597,0.91297941774111269,0.18225542538766459,0.31520513065367661,0.79991548367526921,0.29889777701315734,0.96541895958919,0.13902026056485084,0.9406798997369894,0.15257520121430534,0.49336205729797811,0.71103055075337351,0.98807504195237661,0.84096675187414305,0.51669177361419183,0.98320504115190444,0.67987364700797936,0.92729542969404755,0.44231781570329731,0.70060267345589966,0.83121275677013795,0.62181715035601692,0.87524165198966519,0.2688756167976537,0.5410177559296433,0.53664799299665333,0.77420148151353052,0.81912715763727906,0.74949915805404643,0.12288539157208822,0.59409016969812445,0.30120232759169208,0.88405358920511501,0.43214544045085834,0.54016790733294062,0.11293813902747285,0.32224675224597876,0.74850627593940089,0.27750344046859132,2.4067329187186015E-2,0.72765762706557646,0.62218623417711993,0.14842331160904831,0.66896512019646948,6.8203773247349608E-2,0.8356072095681214,0.6527972021537185,0.43574358433718097,0.95533406098425622,3.6659676882271119E-2,5.4856958408495582E-2,0.87818729628191439,0.91135975979294104,0.3872087071519702,0.66997284400720603,0.55317786811355585,0.74387426798441503,0.83151920412557112,0.67880210779662964,0.2340355685832114,0.81931063909739321,0.45206998955460964,0.92941813869269785,0.78388428067607685,0.27610606680213379,0.79920102449090535,0.67445858240734191,0.87841940188944578,0.53893736535231374,0.47143585685797618,0.18129397270307501,0.75376875446147373,0.26273859353399576,0.52408325795175192,0.24176127644406409,0.19958231944993121,0.43098078875247303,0.89688529061092892,0.963762970356008,0.59491535515430194,0.21977085164127652,0.13273337651626183,0.43600379056832228,0.73916549363222805]
[0.25028686786159604,0.3853230801203078,0.59773256420378817,0.68305390958983037,0.25866855219519747,0.6531040462700044,3.4406164314165211E-2,0.34441446087996119,0.295546718331273,0.67898327666692004,0.57418916329756708,7.305849432239031E-2,0.32673291558107753,0.29704601206489556,5.2506704654684766E-2,0.31526083833295337,0.72228318705830441,0.99554688953764481,7.9117529481914195E-2,0.87566422890292184,0.62970906363025381,0.67089777572683329,0.3576831057526193,0.38718600367661027,0.21172223403564827,0.14080957874283295,0.76635661559018919,0.67016212608931447,0.31310691020755987,0.87717104087342279,0.17299647402256702,0.72003018345251579,0.62524316633027466,0.74717111480410747,0.87601152040214159,3.1692478919276845E-2,6.2023425642091734E-2,0.60699116750080884,0.54510642313099555,0.11687909009008945,0.85195153180007788,0.95773386809420091,0.87495099618724292,0.52336147747631334,0.74386155847358182,0.10098608671400433,0.23082802810738612,0.81942898342889814,0.26761928504361143,0.54269607674936526,4.7818671067194174E-2,5.2888085586346056E-2,8.853827109649115E-2,0.97221882264180404,0.74102565218699301,0.97792374858207765,0.51185133374525738,0.4567625355937811,0.10893773119779115,2.7158519502812117E-2,0.67062974632454786,0.10108939168114295,0.36199808868591132,0.43495851501808636,1.3948720490163713E-2,5.9274217273102336E-2,0.4600995207646088,0.28902805527060116,0.33251661764217166,0.13994846714718245,7.7905817114446663E-2,0.79715226719735,0.45212047315840498,0.87938701013902176,0.58050177943073444,6.2636266396917217E-2,0.34507801693834594,0.1746657140139003,0.39694937055343449,3.0805747374850312E-2,0.97170260237989947,0.2097673496526562,0.63591224115899825,0.11025769641234562,0.8461243055980151,0.62121615045695056,0.79283759392879816,0.91762289764157534,0.30935045341438105,0.98752681022579347,0.82683723198612358,0.44860636916978525,0.41180517015927742,3.7893245280973264E-4,0.36657766579254725,0.36508969959604998,0.81925288787558403,0.76667758801408603,0.60576246540884027,0.36263123154124044]
[3.5547227547883642E-2,0.82444664586182614,0.34594973405635598,0.40010804253663401,0.21364137053666821,8.6780054437145537E-2,0.25500896693830921,0.37872728806974898,0.224854358847972,0.83748664968186881,0.47081109679398048,1.6018522276323943E-2,0.85856847266248448,0.81507089094813168,0.7035358612724496,0.26516053326963762,0.12923400016545983,0.37956600404990737,0.22401614342158127,0.22431386679385756,0.74485555082612032,9.989242743292881E-2,0.96323105095689132,0.19812306804421842,0.74146204635097845,0.93676532887829644,0.57401874513024864,3.7787743335268686E-2,0.70962907974604039,0.51535192033903432,0.1982549641657092,0.22515793539701656,0.21544222591417406,0.43721271117418403,0.55586121665583688,0.93999686975866159,0.38706908338183299,0.51547068093367188,0.55725709735823648,0.3376459203679546,0.84053183815148003,0.72263853253989319,1.9234005311645652E-2,0.58398489855079483,0.40480238933635049,0.29007766033661364,0.65767601627660244,0.83856852666634096,0.85518155936832962,0.39978707220331133,0.67779699529656234,0.86325002459886979,0.56128957675622881,0.3322315816889877,0.36482505238289342,0.28548914338041242,0.59085335629704916,0.925571017367678,0.70165466208644434,0.96686907239580555,0.27374653357574441,0.39820574739396963,5.4611270407063484E-2,0.73055414887076942,0.42438366733930899,0.47627187412186944,0.27217812875378611,0.16113450387490313,0.43057866774504949,0.93021743883480001,0.5098044036377003,0.95847359838852264,0.3118810397366869,0.69606453537699842,0.82106372754247836,0.44816729428674107,0.98165030550836341,0.92440560257476312,0.29377059809602457,0.88890444893434706,0.59530246119456909,0.31144105173816727,0.60396291449038209,0.38251383646402648,0.81998214457809371,0.29192950251592475,4.1865366327515807E-2,0.58221718558969171,0.14635168016983713,0.56994864426442537,1.0695141146630838E-2,0.69543374208360298,4.041105645113674E-2,3.4446227680737795E-2,0.79591711721034564,0.28374773691626953,0.45402589557670658,0.21286424781794711,0.13440828419551387,0.34918909413943078]
[0.43728407975301353,0.23392962789359817,5.4345074424341999E-2,0.65844603510051447,0.43186560755899506,0.48156080790482436,0.48678628044430805,0.55227598951042645,0.49153233304251553,0.98420210615172754,0.14662527526749791,0.95622694235847761,0.70701835955471692,0.42675588289110022,0.81173980372857157,4.5247899400990832E-2,9.9273004309577528E-2,0.38399267634960643,0.11632616949465058,0.40994349825817911,0.51980549474065196,0.54461613545561294,0.58756993408429958,0.6781957059406688,0.75100463075074586,0.93129960039947668,0.96425501046213646,0.32757047039611309,0.1414105669535044,0.67247791108255639,0.72422969249867741,0.62872428247809853,0.57873637128099231,0.7200464470243797,0.88763659477734269,0.14879072450813347,0.70493102088371251,0.72557964831933108,0.69667165713000245,0.69433923710213907,0.7651365245987668,0.76805592870897343,0.4064299082825017,0.60257202075185046,0.34304188728355123,0.28891778604215645,0.39142832597140387,0.79554536396936093,0.69664495189829723,0.58341471982082993,0.35731002273461787,0.40105599152677851,0.93803159854806695,0.29718186116151823,0.57105454561886537,0.30468044083549584,2.101499604485435E-2,0.94095954800590098,0.66892308149871638,0.17404103304248375,0.64572242811233993,8.2448261907630882E-2,0.29509316512254191,2.0774726077418482E-2,0.56837190346706101,0.65361360672094637,0.47193373351726009,0.43414332802996991,0.77672811000172359,0.18289359270949856,0.59141045946500226,0.91479774823032611,0.67260830355852763,0.47814327347709784,5.0524060536724091E-2,0.86732212973081235,0.18709689752298408,8.7630703435930157E-2,0.54892055022268582,0.46231520344233934,0.73406823465244853,0.70047423911913009,0.12500599058124273,0.63166097569581836,0.57614172055046153,0.97025358924650473,0.89134717365224958,0.66339027709356646,0.37203201760082349,0.32766330991495651,0.54793831365246293,0.73875406643048325,0.2062927950528608,0.98087785888362844,0.65919400467775979,0.23698274284927667,0.50681927109274183,0.89706976588607923,6.9300587499856459E-3,0.18233681899705967]
[0.66708308633181201,0.3819264381687647,0.71213052386612663,0.64609663978208087,0.95071568166429665,0.56392534667475891,0.57311282094911786,0.59087566741698361,0.49519413488325015,2.6796072236240143E-2,0.69583602880293671,0.48480103463850976,0.9123151814765641,0.94437081898336916,1.0385342572287071E-2,0.58792214610630944,0.25395701279966776,0.13514883516479204,0.14347664429534612,0.97430021874970296,0.73460957057641652,0.68462852204473634,0.38969800824340672,6.6653985078135136E-2,0.85451730930873737,0.79100805885863257,0.73910619743984229,0.36910093311761272,0.61429494384401728,0.68925594128785428,0.73383249030183673,0.13962069822174672,0.18252879796459176,0.4040557502363098,0.21020588392048578,0.21889730760197612,0.1182615646009626,0.46951692422666003,0.24880392821752106,0.24512060637153266,0.29396531122717673,0.80675609887577793,0.3120586595782332,0.49248013638538879,0.8124377338544283,0.3806354855308165,0.21325207360502452,0.27312872603694605,0.51868630657269443,5.4644168476191024E-2,0.98839353533833663,0.77232428167298905,0.49339057923764928,0.12111085334453686,0.29705159119957236,0.21260097866647742,0.35507076513255231,0.66631114689609861,0.89111047495129547,0.81538852398010375,0.75906784592148535,0.7432278929362709,0.29230045346936828,0.17153353694839368,7.8492227886146404E-2,0.35323821250301957,0.56298142752902935,0.28605851176856134,0.33289713182561675,0.51278438963969564,0.29705980929605003,0.76996014947094837,6.7288792038301515E-2,0.41728218513700999,0.26109828622961961,0.64822833264246149,0.97158572263058096,0.75260304237867559,1.9509989872230626E-3,0.39730293944147876,5.2950408575429653E-2,0.82315716731951316,0.37170298689939441,0.54614184827157253,0.39033312714148072,0.20198331805965042,0.71648208106651523,0.87086550356926817,2.7856729278949777E-2,0.5477665308603229,0.93989224113157821,0.85288063852440654,0.96442686446833581,0.38225912095456926,0.49497064618462028,0.19649231736059514,0.10560733287925905,0.23131621737894736,4.1084321306813942E-2,0.92842897630753496]
[0.76071650295930293,0.63520436665580537,0.86402740369107744,0.40667822881077165,0.31414649067414391,0.64564657348544041,0.2199305437383835,1.1827552042571132E-2,0.50213745415032673,0.6580992029158238,1.893452011893737E-2,0.58923405987589661,0.64751479484610364,3.2815914649039879E-2,0.70519204447175876,0.51597213950171561,0.8280017940938954,0.40940308591582952,0.46296443304291046,0.38962395681939643,4.6307897031442335E-3,0.11689868808712378,0.86505282534672934,0.73736197476235943,0.21625395590579699,0.50923714518550456,0.34308442691879215,0.89089023291351799,0.23812384811247189,0.23415075824738552,0.28977701609004525,0.57284786481402383,0.33876370588829141,2.7127197706504513E-2,0.77060970337690116,0.25911139635351399,0.74141821454138557,0.23112352560230909,0.2512385392928137,0.74073941524779707,0.31201852149898535,0.12911511236734619,0.90661803058852508,0.18136301577418901,0.47873250429175851,0.61296905480185182,0.39467338198339341,0.93644207908323673,0.28296573437449068,0.25646865617071879,0.32712655216441633,0.39908864435006852,0.83404327580504622,7.1933236127729727E-2,0.46778974044280575,0.88606862030814271,0.81647546335762244,0.76679502718625625,0.39863978844230907,0.20011767320103613,0.44718276655410405,0.22629092016025898,0.98980837541022237,0.97843579522750801,0.73530412409851198,0.61647124258949482,0.2171483863282444,0.21796942102328998,0.1336922879220015,0.36805847993640994,0.79685925159633331,0.54386327813011937,0.61801159956243723,0.46393667480936851,0.58865144708441286,5.080071218082749E-2,0.90819716967757169,0.655847320259209,3.9497187877031936E-2,0.78839596628182407,0.73391587208292863,0.30343375004048023,1.845508250326211E-2,0.6000105836916465,0.26463081580658732,0.36807351583253911,0.85701373277635085,9.988601411897613E-3,0.37567956999258878,8.7858682096896401E-2,0.54635873498384047,0.63230243831066979,0.96155112442189139,6.3541812189682689E-2,0.63102300130682509,1.3305559864910443E-2,0.63615068543409037,0.36711238787629352,0.55772782474649452,0.41653481789889957]
[0.60110828635278857,2.5992955686739649E-2,0.76780340038192596,0.66146338228006896,0.42878045200660153,0.71596353107137434,0.25509000616073541,0.75087163844318339,0.15927935078297151,0.1983044831516938,0.13724705221192968,0.71978304007674943,0.93824449040801083,0.24278998621500025,0.99185536745300651,0.30670567567600837,0.24878653628637915,0.89249037546443544,0.81688736436012011,0.72414965538300069,0.34892005088544009,8.5130468874839438E-2,3.6366981828356293E-3,0.35852605377559355,0.12034551035446661,0.52881498667871729,0.46337566254895468,0.96648211518267968,0.61983196004418573,0.88977726083577657,0.83225240314683191,0.57312712725001425,0.16655295252723556,0.49381995569666148,0.38169436735045092,0.83623857909335853,0.25503490115037553,0.98519137524368838,8.9447753881750081E-2,0.59762747805597016,0.36294942860326729,0.16447264708804032,0.71120622267144507,0.83255698864742333,2.1090438032536296E-2,0.95235954146254254,0.97406607397136391,0.95864621661518812,0.92880632494358095,0.96533022261745061,0.33336239897000552,0.9037039608456694,0.75256173687502548,0.25978610989715456,0.10018464219462664,0.15962891355184994,7.7992029249960848E-2,0.13336228041980036,0.47503010631023512,0.56760954131786012,0.82366642666414736,0.34195146877019345,0.52536185810255176,0.42262431768619679,0.33103753359957433,0.57854896525444544,0.73991477819603568,3.9530771767345096E-2,0.79168474976915915,0.86392241892322486,0.33746085266855441,0.47169281181114175,0.18486476479710945,0.24848203769972221,0.5650585104521616,0.85203058300722534,7.2533024440094129E-2,1.289509279163048E-3,0.56361253810665368,0.32553370160470163,0.9717398377051939,0.53562786096641957,0.59490105776052649,0.85744823803215775,0.72698690958828438,0.33753855028873503,0.81467040046212458,0.43854818247660421,0.77635773700413502,0.27002076156927945,0.44181881484762542,0.97365120440153452,8.9956181397221946E-2,0.83700471518559927,0.6102533677587918,0.99221897630384814,0.28422099369278864,0.6400194220083707,0.26846934510339404,0.47520415149086248]
[0.24469402951772368,0.80682076436563932,0.75549139665893306,0.97710704202397669,0.69528795342868344,0.54758242719465178,0.1400483442899727,0.5566749461353786,0.10543120578008491,0.11183475538124299,0.12298615932883017,0.18971290030324528,0.81242480910954185,0.92416417977432497,0.1484324497852223,0.2270206707393001,0.90990297143690801,0.36226412228444316,0.50269146215451155,6.9141893587008951E-2,0.70138007811174718,0.92540849026681549,0.48510767945181454,0.17461638655990896,0.44143430567937403,0.17733761792011471,6.811395671114584E-2,0.42645393287959732,4.7083440114725872E-2,0.91065645596989608,0.50632156548077933,0.95016063451986865,0.11772006768506549,0.53525855213347706,0.34949693290662465,0.30947285089866927,0.61648950518437917,0.8090275037330491,0.29125542442967445,0.6237785298430244,0.77510571798062122,0.49254998336659805,0.16481135195515684,0.2592609765533167,0.83555045314041254,0.50044644460373955,0.90624637896842042,0.34853518771775072,0.44315571792677555,0.53730425193339038,0.86266873627425755,0.92864716997893593,0.62899144000457907,0.39835040309154235,9.4730630491243639E-2,0.10841481760546967,0.41799716414663568,0.99660642549499123,0.50275268792211802,0.9907479034776161,0.52763642101529951,0.21757892601191142,0.99405590654596288,0.14126400094310587,0.97518200417426049,9.9009157293457384E-2,0.84519466039577273,0.84092498119061398,0.92898897664797764,0.8769572482975091,0.99305618750288904,0.59737161492382795,0.36520119606623069,0.34865745395529368,0.5579616682777202,0.24483264978302055,0.16550200806051685,0.32168158271173342,0.97886874808736313,8.2756772374992682E-2,0.29433758299672863,0.70260492064060487,0.62325285639295958,0.19965626544863013,0.89520040374758258,0.65676353134610999,0.16746582482190997,0.27469507237788515,0.49647574490387125,0.29050001273626025,0.8180751014353449,0.48323188498924075,0.50971686861419929,8.1995689768979862E-2,0.5523126906856326,0.69050179790510202,6.7454126790155056E-2,0.93423518580241294,0.37306206618739768,0.89151616678207624]
[0.1481320064248387,0.16405715729858472,0.71603842884415059,0.93651229056350471,0.48164308300435332,0.95364531811024666,0.93283890742557352,0.85290806688182297,0.43641491793190534,0.79804849374748665,0.8862743867896048,0.78876995610641543,0.33851743100866005,0.59471397826940187,0.31589422496278219,0.6846838385010543,0.49611096448806336,8.5686950470177714E-2,0.31728632838718884,0.52410110695409629,3.6852108338223943E-2,0.84410292944739129,0.8020400839886751,0.88528952355336343,3.8568681280047645E-2,0.23277055351718223,0.36683434223127842,0.71496435399736047,0.43546039427442096,0.50796914995316433,0.35221025909647763,0.62668615731837918,0.27142942173083973,0.13889530734416811,4.9845887718726778E-2,0.12449627638256144,0.77961564340292067,0.27523620120867054,0.41279841676451745,0.96954995496998908,0.33411006778989871,0.34980911589014196,0.92656143289113391,0.73278280851222277,0.92494766193305122,0.71284720707339766,0.24089963147029592,0.71622897526721407,0.77720237983204987,0.36841141159453494,0.67533443977787844,0.95578685135845387,7.6578761164525888E-2,0.36649840930143796,0.34602242870510469,0.9253628488083866,0.60797436987607267,0.62207749596209216,0.29065466234585036,0.7415232836723864,0.69580631107751822,0.20888525604254782,0.97224737356835944,0.65248399595612316,0.11893118051205553,0.59200202075313779,0.7458610924415825,0.61339015242131101,0.60495454960011863,0.39501117139303277,4.863737081292574E-2,9.4141681147387302E-2,0.15916932993852451,0.76542019530782468,0.40934839914415144,0.53422856404644115,0.34199679545945572,0.14889107097983867,0.85387734539800275,0.51883488388554289,0.24110884990738179,0.99688228881812146,1.5285489240074446E-3,0.17501600042453602,0.71805657210019025,0.80957688382410575,0.77193784743264027,6.6597432619351804E-2,0.60494854766340189,0.73321314884251942,0.4265184602606914,0.47296827089865223,0.59990535398247091,0.84100634129506591,0.99640519998829813,0.65455677000007628,0.64099524678898856,0.50488218634255144,0.91875293086881926,0.49042224373355203]
[0.46738528423341774,0.5991121826160789,0.54796624959509355,0.14847667586836344,0.89517580335398383,0.12824062374030987,7.47537591162174E-2,0.98744401055349473,0.99419049125758796,3.1051298953593265E-2,0.94994134735829028,0.27914534899337851,7.0119388606629585E-2,0.16648877139723239,0.31295795916203628,0.70792464033554037,0.15544168355012733,0.24191075577094978,9.1571034393512774E-2,0.35710791886483473,0.63817613520029992,0.86988365878037199,0.37171837898904747,6.5750779797115855E-2,0.60078452879002997,8.8336976502293552E-2,0.11573774898745159,0.34806854488440186,0.38213318742538804,0.42749670186183786,0.63686325803273158,0.49513094106460576,0.13587531375035489,0.57324903559866791,0.60977509903413274,0.26312695621732562,0.75586696238044171,0.27963937173594977,0.61886537875513326,0.4369218549256465,0.6026883037226497,3.7032385537057566E-2,0.53400510368576581,0.99387750528036589,0.12062467610621885,0.40016364688821282,0.15821717191622608,0.80434828239978418,0.59107407778334664,0.14060651494040755,2.8387487983910775E-3,0.81348912526721562,0.53008276605269689,0.17221086140781383,0.97243577798469083,0.37166840797009959,1.8632885233757834E-2,0.86140388110171773,0.2055557572658312,0.63029170342083674,0.25660416082136328,0.63471213969740514,0.54258511529252218,0.95430786458099048,0.14674379801501158,0.18073948509852011,0.9950077203322476,0.12241523153659106,0.63494841191605245,0.8230752057616888,0.49765084890729128,0.91307960556572365,0.1184221522188954,0.11691342702102847,0.41867272003878009,0.255845587497326,0.50237480377898236,5.2829237329054313E-2,1.6578485065868565E-2,0.39928605328575451,0.10633441962579127,0.23133048373809451,0.88071887206795485,0.5071384394518037,0.17309422665810748,0.47912222046911113,0.23143889717751165,5.8885184410489178E-2,0.28045969833843709,0.95230904178652753,0.64664636586774638,0.65220601980685966,0.97688809942450505,0.8361870878519081,0.33621783194083799,0.15145085613625753,0.68079558003904972,0.70787154717840439,0.51655577223321647,0.30390077313654218]
[0.69376001013065181,0.11062540855803249,0.50135981151764264,0.50952122006303413,0.64851405286829134,0.69136314365075435,0.71988551448724714,0.29892416488626272,0.48565306007287778,0.52781299348431521,5.5141865144382018E-2,0.28869507711818554,0.66543065201238349,0.46019653671499883,0.73604013856383654,0.50640226127426757,0.63096625694577912,0.54644956191895977,0.67839334882412905,0.84106947085418193,0.98147570429867048,0.13892968768141578,0.25366370475050992,0.40430317915365666,0.42337124450499886,0.2926746046187606,0.44892167352252743,0.59114261422440206,0.19147215605206103,0.95726849118816892,0.70370148378317765,8.2818817515251109E-4,0.50357194547693196,0.18994852042210897,0.21727275805970137,0.23654644803327118,0.45800133848685942,0.96443918679081997,0.50333614633577883,0.15057227769332382,0.90649487290165531,0.96981513911644979,0.79279697517211978,0.48622717608807953,0.20336389733871829,0.57876018234524429,0.44770227253964723,0.56377716918803511,0.38629669417686097,0.59542918324988237,0.68069752914834647,0.8074624665864083,0.91632285172645667,0.92821566443393633,3.4557507806211585E-2,0.25824239893351353,0.67301372613380417,0.94075550277661102,0.65181299097090917,0.90954749678641467,0.58042955167124111,0.93330715386228857,0.61821001621612326,0.27637382222638218,0.15768586335560397,0.37847095737320324,0.68611321568734229,0.73421603546343805,0.33113307362799416,0.67880186086004501,0.55249562194296842,0.4093902570122544,0.60406900462135882,0.21941944613208708,0.4366138178084854,0.42374240832112564,0.24421812133264176,0.62349275171610619,0.79120968779559964,0.26327207332868152,0.76972239911287743,0.29826527649522583,0.16380659078738946,0.84291242993154725,0.23062569175529246,0.47805469786997734,0.53309344541744974,0.54902331996790765,0.46295871226614616,0.30586802258054058,6.5370880189257852E-2,0.88280478882192148,0.84373234478435255,0.1052341678184926,0.50258601303181094,5.5114353622291667E-2,4.6942969388281686E-3,0.71078535091882578,0.87024983546584289,0.2355600266572857]
[0.52781822828915348,0.54619464236878557,0.6599370710915784,0.24524839151896849,6.6545373592674317E-2,0.60442093308139566,0.46201193063176693,0.38480735286544054,0.49054080692829638,0.52759047550053151,0.99224697849235333,0.13193011994862791,4.5377859031702217E-2,0.34925361272427491,0.66618546994739791,0.77757135955066736,2.1363928872055737E-3,0.83847750759542361,0.96636473410742885,0.6506801390392869,3.774538973699193E-2,0.41121117646328653,5.7295031068233193E-2,0.37597692970734342,0.23778329280061128,5.2882315784158473E-2,0.56473473882937186,0.64608996082404269,0.93977907700002017,0.86886356792729746,0.31286590478813148,0.43380882785869679,0.64888459307469359,0.45171877546898764,0.11409474203288761,0.14439540789490279,0.59478969813764115,0.20917888994174849,0.2860916460319608,0.54162961988696012,0.31160881781726413,0.34641844576840419,0.91309713252863467,7.1310129601333427E-2,0.27270250815866048,0.69603687902064448,0.741255558779924,0.24116668305431688,0.20732198914433375,0.34700237986375659,0.47478860313512616,0.69738501448978341,0.20403430241737697,0.62957671167387452,2.9070382785802318E-2,4.1646129609306359E-2,2.5463704696042089E-2,0.25723569846909089,0.14068763100599901,0.1733483821316979,0.57850363131110039,0.53228754599758066,0.43408083090650196,0.7994344101286881,0.4645705764069763,0.36280942316391518,0.21586766837236726,0.20168626972558978,0.32082086993876258,0.55294579900315766,0.35452553296146527,0.99866420941811163,0.48078278766428628,4.2034120369455641E-2,0.20446124204446603,0.71477265892043418,0.26428397043022955,0.2051105967979876,0.96895959560316669,0.83055397522707364,0.29619350329413552,0.35024553226398414,7.9563064044288034E-2,0.92585752591086912,0.32829007346104799,8.4318955652162186E-2,0.45543995171192087,0.73510250369176144,0.86228307954512351,0.18702772385255895,0.50732179302167302,0.78900596255648425,0.71330578989829319,0.91427653006049547,0.70432975139930487,0.27364314759743902,5.5553607144955275E-2,7.3772515362238167E-3,0.60442936426758187,0.14065333892478271]
[0.72811292621254353,0.32844399221987486,0.34239719464830631,4.4477095236801212E-2,0.53649911050881882,0.61926977762848068,0.70326323857029782,0.25352645763927473,0.31962542976055086,0.24354838062091178,0.41436187791181078,8.6801838268229625E-2,0.30187842595003378,8.2463162133985191E-2,0.97850754965735587,0.84663774681676729,0.31965328548387639,0.22520053003808571,0.95526840934183288,0.2969556786927291,0.37096799773770328,9.0992954700038542E-2,0.61225250712726909,0.54062707838255109,0.50151599686411408,0.27971074156381115,0.14371338971831638,0.11631968602867082,0.90164274892596463,0.86102207474206471,0.38059088057005841,0.43766464088592927,0.64643570142040419,0.26651276411219793,0.53668879893407928,0.86611195255727391,0.74799619296082509,0.69797064181044233,0.3621870531082626,0.74797457204741946,0.39259179579448999,0.67558506648344097,0.70661813046155475,0.10563089473668164,0.30629993740799333,0.19284291662495956,0.57490914538987292,0.34614075398330169,0.231570700865942,0.31399959913793629,0.42865502468183103,0.10196944737164881,0.51560945739611774,0.23074043181738257,0.73599236485878095,0.48237476687093872,2.1403338950748307E-2,0.59129159147528243,0.71160568382406819,0.50193434929699876,0.77638995472695949,0.11771661162502201,0.5828178269702482,0.69243940383789571,0.37363884563553762,0.7811777566986351,0.27245723333513794,0.34118302164625747,0.72707277635791234,0.64481661518177857,0.28371983960685643,0.82778294496437399,0.66839183591165152,0.69418274167755611,0.72579320012762105,0.37066486452022296,0.70709458692389138,1.3114813185171159E-2,0.217608332020918,0.15801649073493151,0.11398843024111605,0.10529721530058278,0.44584074640967974,0.3751650816529245,0.96322943682147677,0.19229573309836112,9.0804436711308556E-2,0.59739633436643957,0.17571306129960451,0.71155791362803567,0.13813199894110073,0.36099607456921223,0.98825277600103356,0.26507059714556325,0.83161422838922172,0.26997486533211146,8.0273247630003208E-2,0.33213975154103059,0.1414205066908133,0.35051835005981657]
[0.62072069833023125,0.2680871467156466,5.3782402051182787E-2,0.65872238727806076,0.89181775813471853,2.3795146967264147E-2,0.12247749624438509,0.3275753870277619,0.21263704664743721,1.814201815227845E-4,0.73077256575248473,0.62222095796322308,0.62386157703788447,0.63165414700453271,0.21037821690219283,0.9443644733907437,0.62896474796025437,0.3257764924111286,0.76019568365412982,0.31788435950243432,0.89730486927754594,0.32825643451388942,1.5187698291910356E-2,0.87276058190402506,0.84527083879653386,0.10236669065791748,3.7452703252545572E-2,0.10226186396123038,0.43718476560040909,0.78949754745293488,0.20084175565946849,0.17748280921970994,0.54771924217652213,0.78353085496343766,0.19710066474740628,0.93541957832235556,0.99310794188935414,0.93552860717276498,0.29937396968249086,9.0817161366131605E-2,0.55825084434945249,0.40619330076836369,0.49318474823956981,0.34551947120960014,0.96490876596517927,0.33447287072188592,0.90331709782087999,0.15517145319617465,0.44072435804493482,0.88469275054559526,0.75691091476906391,0.86050853583710141,0.61777321608029945,0.38985220206850268,0.2847879843760508,0.68280126444919231,0.61480632292713966,0.56992450472094147,0.71405736711779599,0.77559385517781154,0.94749027183507761,0.4696460279047433,0.32739527810789792,0.43250519448534097,0.62252479962564045,0.6164331814597015,0.76564625312019463,0.32622739962595459,0.38417423427253372,0.30378133264059348,0.97499525270724008,0.6519545050252028,6.2805840561330983E-2,9.8006701706655597E-2,0.32417241636322547,0.43828577605028995,0.21743689494203811,0.9937660914508053,0.9334303395711584,0.435766013028002,0.62167268559796285,0.41739351155711391,0.16018319542238812,0.14651895940442994,0.40203637569624129,0.62028918075787531,0.62418349296623865,0.55681832270923282,0.84469093422771191,0.68814667273807417,0.69901913595735188,0.61403054414686242,0.4786430004570813,0.53440198760369328,0.6716614254226132,0.37110213435421724,0.10744150589801937,9.0550641413830291E-2,0.30744864980465136,0.73752751887252677]
[0.44134678931525395,0.35571910963678566,0.41716631485798195,0.37126466733983099,0.58563872565611885,1.2965319765498862E-3,0.93414271429547213,0.72614212508487319,0.51017714318335827,0.47468772971849171,0.6596098438488659,0.75935032832645022,0.98028199679027939,0.61925668850704729,1.6655088459219702E-2,0.62318588783915418,0.47910229095275214,0.12421274399924409,0.60643252359679467,0.99131913671259486,0.26663213845418032,0.46999477131916667,0.56725770338637116,0.26204724429091009,0.7882729304388495,0.21799814466742062,0.42728747052713734,0.30462102977244276,0.4780800554766762,0.89991955740468743,0.20216405198690823,0.88020387125915955,0.17846627174410412,0.61994537796458771,2.141637186075962E-2,0.57275891493523112,0.51656264971799726,0.12277186840877219,0.24941466399401357,0.72120379562931081,0.79895415909811862,0.79462888280151922,2.3885753058704884E-2,8.3628509706841991E-2,8.7096211111808874E-2,0.36050386325050698,0.43327119423138627,9.9763062023719207E-2,0.99931853781492253,0.24297148063550944,0.95364443224184647,0.85259558003341451,0.67164443258368212,0.20016809179617023,3.9811023531052259E-2,0.9492276606734561,0.3521789251380455,0.3215735657455091,0.13372928961921682,0.74032362870759882,0.93616466140394405,0.1526776477473224,0.21120375807963843,0.24830282124221903,0.18092977154645551,0.32591820678708017,0.28175743884519611,0.53413905126460548,0.50547458544529988,0.91397413728327592,0.78839831383298731,0.40742389403327517,0.87570163581150529,0.53244303698783058,0.20008650102924885,0.2066399033292573,0.17175002364798364,0.21304690029158879,0.3574358681274622,0.41367874477968369,0.46327217135441157,0.22255125360439942,0.19698840048763921,2.7736266737349302E-3,0.20814505292838092,0.91799611958634886,0.36345392517949382,0.6216190420294333,0.78491990274001022,0.48616365997318889,0.63968189534409781,0.80083271255088762,0.31624866761685688,0.13059619629481356,0.95348998466622925,0.32575527205966937,0.82737894095135678,0.96492571080808465,0.75022144313656036,0.20601568786821089]
[0.20616067494891788,0.93833534529396068,0.16823029911769727,0.43409162288001313,0.65997823072655859,2.3757643223068392E-2,0.39196498019156523,0.65834560549523535,0.39970418788046647,0.32726360065705906,0.71662961965167338,0.2199708246377734,0.14284994941961004,0.11087651001184329,0.11117784749909199,0.55079601968028102,0.82014479593944489,0.80308951124127514,0.38632502788692691,7.1992143525489882E-2,0.30740018846208284,0.58279702340881534,0.95161411013819797,0.64355208160556232,0.96757142237792304,0.39564566433773907,0.15423150360159676,0.13225375804385264,0.63999934795020941,0.68761662229322262,0.52490282478638239,0.94763721677593737,0.53413703451101602,0.51237507214031697,0.6056319884766338,0.6264904143515162,0.33181300696371363,0.45956392642457,0.62551922487600231,0.37817327198203521,0.65391843315565346,0.87518268460278947,0.71311058304701957,0.96833001332235769,0.89019526907747404,0.28610610610677989,0.83798205923874225,0.54801981545539369,0.29643023664411028,9.8199910228856657E-3,0.2010132546509622,2.6641069514592552E-2,0.97699295817019982,0.34915968495672733,0.98388021590859964,0.3905781365909281,0.80803135034077977,0.32763437688506136,0.62958151426728615,0.31385160663702227,5.7390241004730891E-2,0.63762996413832174,0.72023236172238403,0.53910131920034887,0.46172552742429962,0.20320031944123551,4.0550507853315376E-2,0.18691620237847528,0.70565422834605895,0.16212623802475634,0.78558866944266936,0.62167204140801113,0.92860752494717458,0.80722643682175521,0.4949091782169095,1.622961724535732E-2,3.7603863443623875E-2,0.74686119697729192,0.66174448819104703,0.919092888529497,0.12131263787290991,0.56576222492451,0.73757040939876184,0.49158607271011323,3.2989339784936011E-2,0.34235774633296401,0.75278191544921891,0.96864405174442925,0.65103112217013448,0.83375569666770255,8.8227326986345389E-4,0.82955214630423046,0.51108164579144222,0.32901454186909429,0.44098268366415272,0.28884473892849261,0.20932740389349203,0.18002564809317323,0.64439752735645717,0.72905455327588731]
[0.1378260066014928,0.14016909636469432,0.4864129163422849,0.85740748776718978,0.64678546473492005,0.35615101530791571,0.64808491369387033,0.39327172972628233,0.99462906119891203,0.92788041840753122,0.68332167307916936,0.65179269080875524,6.5672159737819147E-2,0.3312731999780254,0.40812148686660499,0.46692096747840717,0.44203364820821101,0.75373254575134763,0.96275806836822742,0.56557141115042631,0.68563626733430749,0.99129621432924575,1.5661281290348272E-2,7.0092546680300627E-2,0.10274001097015928,0.90487478456330195,0.31391595793483618,0.728356602379722,0.58645653043197765,0.89394425161804458,4.4087814833097982E-2,0.92605238519137956,8.2490572485359293E-2,0.31684629154851363,0.8279291386590516,0.70600616107543557,0.73015165865783405,0.29865318943647312,0.85475993794940852,0.31681288815447162,0.35246329436267065,0.84537652452438061,0.54156150194567021,0.93531503447662934,0.93573278171402563,0.96350351370949039,0.92714416227741803,0.81761000316223309,0.99697894672655041,0.87838216559591953,0.4471214342466201,0.4133444382353284,0.50701835865214484,0.22919782046860804,0.50025691326882249,0.70168123584948749,0.13271590477481821,0.32865639318616235,0.34318183714029338,0.92993643943550242,0.95482326678578988,0.15747700317052238,0.66526156332574915,0.31781662362919616,0.5062391222577185,0.14192369939962812,0.83093877270713712,4.0031026972327965E-2,0.59414149686349971,0.75982833443772579,0.62519351255959676,0.43304738085534666,0.72729692321534434,0.40432859484963668,0.15968815745143239,0.41974244288203333,0.38439458880571542,5.9327521409887396E-2,2.0930344602956286E-3,0.94030562762384895,0.74507372637215474,1.0476741821012769E-2,0.62710993829793149,0.98398339322897566,0.72100457701732223,5.2135465594962849E-2,0.55048165366871582,0.56595532396957371,0.2440826904495329,0.61937954062122658,0.60364117375801374,0.42332935194942656,8.1795161204466615E-2,0.93489697264148819,0.88412524432038075,9.5597120394802282E-2,0.49407509134747429,0.1538377364497725,0.93111646495264133,0.50886239735527272]
[2.8081384906111673E-2,0.14911013901616743,0.56483094397509848,0.30909723593434923,0.11901760424067231,0.31412258932265091,0.14771814038155506,0.78160885812226299,0.47760306705666655,7.6404148224855528E-2,0.91289183364775794,0.98213851613818004,0.66581464341981822,0.38379208530250331,0.16263401303962932,0.53167465926315427,0.3673134412166067,0.68810867584389435,0.17375814529284228,2.5915424583271784E-2,0.26046030155985578,0.2265489391422022,3.0668939239288373E-2,0.33553582867124243,0.58533599209978826,0.62704135051072241,0.51943188049228972,0.21495842695257894,7.3705304525851334E-2,0.752266823670664,0.41604625579319376,0.18587438188248617,8.8291027036790037E-2,0.99313620943670122,8.1624619306900681E-2,0.19474879708710258,0.5636076336948227,0.53516556340060573,0.1398588452864058,3.6197260837624534E-2,0.97913957273736152,0.69809001797275094,0.59109325341649943,0.8027226726445289,0.72602040876379348,0.21765797329591863,0.29815385146774509,0.21429290199170092,0.80879651214322246,0.94241811350440141,0.20879359862512259,1.8926576021733865E-3,1.7269071884384424E-2,0.14520028223518799,0.71776929779233145,0.10080788413094999,0.96314687903766394,0.73174305897335079,0.40603600637778392,5.4688442908339074E-2,0.85883595347859998,0.53127358837808991,0.15244047358653356,0.71077942702303054,0.40069477273276999,0.94902594499836601,0.71011444122713319,0.10240757461279504,2.60347481007559E-2,9.2268037871346964E-2,0.14565035673494831,0.39702502789787519,0.9516474298595089,0.6220639875306132,0.80043836978725669,0.13375366870707484,0.93335469458674092,0.24882025867241131,0.96204639101866518,0.99909371926185842,0.10816923051983185,0.94884220751623616,0.52683352049336329,0.33367957560957284,0.26094284586133676,0.62158732005295569,0.18433099030041133,2.1951412482223542E-2,0.79551238534401147,2.9928114063697442E-2,0.61886847823769087,0.68271065024074584,0.64421179172379561,0.47992594363255647,8.5964304062173702E-2,0.61166232263891684,0.89041055560153248,0.35771165851053877,0.47004829094588729,0.77361830065517656]
[0.85208499589257769,0.49904529409055953,0.96648389576995797,0.32270610717658743,0.49729515676230152,0.96292793680778244,0.74742551981736194,0.75544002224768292,0.1497748624735995,0.71006153722778209,0.48389138343652394,0.16592402821229613,0.2165905540301678,0.69490876189116824,0.63825324023344809,0.56146346783269585,0.35037995828900159,0.52114485037448088,0.18683610204083589,0.87741666692907871,0.70724823969852824,0.1792116463401191,0.30377177816027556,0.14521214892501655,0.65929361806533016,0.23030013248274139,0.760156880141027,0.95539040284579058,0.3311516023522848,0.25519324443370983,9.268514767331415E-2,0.62493995547240833,0.2063754586783374,0.82042952472644282,0.64660679660321685,0.33995461248896885,6.137679012659536E-2,0.82300182176481418,0.76602411131830472,0.48589591082240102,0.33589279997725519,0.4646284720575411,0.36517384591740665,0.8717800569532711,4.7939918920355207E-2,0.48765391993162666,0.99155653851923498,0.53657399493285274,0.27461713650479602,0.62118344234780487,0.32964374297867716,0.98136688906346936,0.94989006139763832,0.54056326868680193,0.10505127993835883,0.52923744820218588,0.61947479787940241,0.83525329359455791,0.16874698842804248,0.15491834600028698,0.84777381234010074,0.44636690348488561,0.18383907391282373,0.6637561032478233,0.91921671716309972,0.24652157208034353,0.15066672197440345,0.20814728587674725,0.63168886263809176,0.42925234915481714,1.2016464107316382E-2,0.65243767398039609,0.43660315875741973,0.16204864395043261,0.31639840393966634,8.5252068860813712E-2,0.81249542643811712,8.9264686301098517E-2,0.78372035037802057,0.56773809300847522,0.20952025591910683,0.37843953522715412,0.36824170967722691,0.41630642808094198,0.16195723868457035,0.5089286062570334,0.3234722650607128,0.10591334696892885,0.80786785168688624,0.88228196758752242,0.84631732066020726,0.95282571359893253,0.74605625720900326,0.73500470652451377,0.85734866328392956,0.42849177985520959,0.62092400221486199,1.4372090620508149E-2,0.92535429257967605,0.16507480028705601]
[0.83131824777824526,0.29902278320158271,0.26138829640305505,0.23258672964288607,0.87082488749710751,0.38183311845600609,0.43148769752089644,0.75217861392777696,4.1279224383979574E-2,0.93497807761219609,0.46123904620018696,0.67607761093792318,0.76888010752032032,3.6345774322541491E-2,4.7739956737532507E-2,0.46524549705230522,0.93296146241415734,0.33167656972517268,0.58936702182335865,0.40571495496572685,0.13452635907000055,0.6896154470707373,1.2505020610379058E-2,0.77397570486087253,0.5174008261170725,0.61036374346632305,0.98730984689246648,0.43297932416391649,0.89813941184576196,7.5351992100260778E-2,0.70356254443975597,0.94757683469288279,0.82815165097190302,0.69964587127723588,0.92602827680809585,0.79670473124776797,0.8133524833023752,0.49850165901319388,0.75558490916322119,0.27575403253424791,0.6311330100735687,0.96523294034657126,0.41675381481201235,0.28758965419655047,0.54604258788888338,0.70135277209173796,0.21953689614709937,0.41682555360813223,0.22984503570778858,0.5537814415298391,0.28484148912686136,0.78151223663401215,0.81974247040482728,0.85138821914076068,4.7015572119759153E-2,0.46513913403067741,0.75760564709119005,0.95727219095683569,0.96539750984421369,0.34060381016161778,0.22821202484575209,0.26436682277738111,0.30977853432706282,0.8668397028297824,0.72800167315414821,0.67619535533317088,0.87598884116849329,0.74129497797400434,0.24122050592339916,8.4269432095376295E-3,0.31689432020024366,0.89619656072424669,0.14958007615156421,0.90401655902833877,0.4307953428096345,0.52964454469002054,0.43370891043786863,0.93793375689291991,7.8825950832789982E-2,9.7161618345681378E-2,0.49556741243284042,0.60070044678543399,0.89854839292592836,0.74047806252751625,0.33818950717127383,0.68480081708744978,0.89929740743075082,0.65993057533041632,0.36512476527663984,0.72816881314845794,0.21431246955796601,0.81562882374232848,0.26974752738680985,0.70102165476386091,0.45932372117188547,0.72526701136715044,0.11384106913915504,0.62647730228396459,0.91279249223699777,0.24944539844737357]
[7.1823041005631749E-2,0.51782621589356681,0.34661954433994702,0.72922835058817459,0.16921149591145623,0.57703137921095515,0.65950930354602322,0.33480068469460045,0.71042089505411676,3.376523437582224E-2,0.53869897484416973,2.950778167013457E-2,0.91272501171053577,0.5462885714324478,9.4091163266703082E-2,4.7811124466365151E-2,0.16631184371950303,0.18848742631124837,0.14010268155180838,3.4455704454085745E-2,0.31060206734891471,0.66748468736058242,0.44083134667607149,0.24578979835936576,6.3825050951622497E-2,0.4784938239088482,0.22079521542035374,0.55273256884439437,0.86975208653966174,0.36008209769636546,0.24088841095913072,0.20796939413473114,0.5159904239872114,0.24145749008204775,0.91732265329015883,0.44238425851743846,7.3752095630412073E-2,0.44430073263161396,3.0048222311405803E-2,2.651302295072655E-2,0.39943728279056478,0.92104892985225462,0.65446193871040115,8.3000956245055102E-3,0.69771488407553728,0.51060475425470575,1.1588308883025977E-3,0.90465638426848494,6.9083960007174983E-2,0.74072384965770788,0.61587397847048564,0.66977355785207371,0.13110585590492163,7.3453847029635311E-3,0.19354645116642555,0.3235056218529857,0.68745100904048762,0.32986587454426741,0.86223695087875285,0.36844092995115829,0.27909414666698229,0.93147735489200656,0.18010905758400431,0.10315772954249902,0.43276149789207119,0.75058408945489286,0.51710911194206322,0.75153396518472237,0.16195236746210295,0.60472795529587953,0.26196186016304279,0.46738697238531013,0.56534386855849172,0.12972236049072516,0.74069328123766176,0.73544316949948629,0.98217496494995082,0.81279870777995789,0.9614228344878839,0.54932345844870745,0.7083156573826267,0.7138424041910999,0.56724247036783071,0.85986410188305573,0.92533793140909104,0.60363140542062688,0.45361875773616311,0.87111905070847484,9.7713873759333603E-2,0.82690068626776014,2.7188402940695799E-2,0.1131378802894879,0.19243061054308719,1.9548719234344425E-2,0.93758101122071824,0.80931062480557037,0.84046000687939493,0.76790519556069203,0.72427404568459519,2.0320978221908148E-2]
[0.26709775108447087,0.78912777911323839,0.91847069803930348,0.39772912408389627,0.37354759487816724,0.9941300067569695,0.81727346182127203,2.2584648291614884E-2,0.96137307627920676,0.98722085174636509,0.38747766354821556,0.49144302107537396,0.50230229809214155,0.48886585059368159,0.1516826274178823,0.85829243597222615,0.74182514785079856,0.60919606624478029,0.22785582846862273,0.81133047407617698,0.83837560556345114,0.15447422527211918,0.13170427626554471,0.29315041506572659,0.11111439084987917,3.706325541666633E-2,0.28813651358621417,0.98567236881436582,0.15824017332162243,0.33933590957197246,0.32219583614271485,0.59641647555918298,8.4095499493765935E-3,1.7714018361541295E-2,0.39653151830461986,0.24496137311759469,0.83701096038470901,0.47732115083380489,0.82846782945480535,0.41528642344249056,0.33805118260322686,0.53536933263919062,0.35520271438614004,1.934047327777344E-2,0.50733797297758243,3.2581504739933154E-2,0.55217687132477522,0.67744369551348915,0.94107715872622366,0.31701851161521899,0.56653852719917641,0.1316708356340196,0.96364493425123321,0.39575263984242037,0.63731229295724512,0.88194143122570978,0.73063432969265985,0.80204014955744796,0.87643995932227703,0.82899253910326354,0.8244660103464645,0.7825055995151361,0.99723812588827099,0.97619210863916994,0.98897984769880387,0.62301487671818745,0.45628295018647458,0.69775373177984368,0.86343867043948341,0.41335123448456235,0.85116190949558268,0.92234172407534409,0.71234913066302008,0.77872253585166817,0.8260873046034436,5.6063684770815803E-2,0.62099516948253819,0.74266307290822742,0.56233006519932571,0.4202701009358597,0.69860896444894038,0.24672329566438178,4.1240558892883916E-2,0.63625239707996162,0.13754326064460598,0.27087409239135518,0.67273407167906996,0.53985212760147561,9.5013947979449065E-2,0.3856243371002599,0.89446126510161206,9.728262593320125E-2,3.516801496285038E-2,0.63902922263366346,0.69735011208414044,0.80571738748387156,0.95746699269188729,0.35900264557524586,6.8718215734047239E-2,0.6278871385896968]
[0.23088964141606583,0.78553689241859104,0.21764400312674503,0.60297366361547555,0.59623088191661933,0.1782111715020992,0.33092465659125703,6.3337141698335375E-2,0.48352301778079743,0.13753928002963245,0.14711293109090995,0.46558609987141308,0.27968366762144581,0.96428799814766197,0.56008134174312396,0.50362368912738453,0.40534682089448826,0.43824047661474053,0.55693405149634079,0.68151217102273975,0.92891177962659499,0.51965010823612545,0.29350979901922791,0.71822050628331868,0.8091498549132683,6.0081534108264334E-2,0.46559221946569784,0.93184771002478228,0.59244072173162188,0.22562945151778313,0.33158560643308754,0.99106056557078126,0.84219799011999774,0.77838284024857751,0.14590349683275683,6.3324043286842935E-2,0.87210070372440984,0.48508717059791762,0.20394950252127364,0.50673113143504267,0.60613244488733131,0.68277509758103661,0.35748427149648576,3.4624117100442886E-2,0.4253314418225943,0.37332625494276483,0.21723374683301266,0.90429856951146126,0.75897181746098508,0.85173652493908958,0.47002230190255989,0.59742184391452402,0.75467270067953229,0.55222409872184752,0.85682328113045336,0.95480950694189026,0.75201397958660843,0.92264757696195365,3.7725113781416075E-2,0.60143065285091113,0.54256032758568706,0.26052807409293754,0.54516993503424394,0.29958290283322697,0.84891777943725111,0.34682166571442408,0.89855768157871152,0.7113338443668682,0.13211793170921249,0.49044144857412275,0.11484002842799734,0.14161002614799223,0.97165791418273617,0.88353536486632078,0.80009342268363326,0.23529904845479443,8.7055254463101694E-2,0.86859847851005423,0.40571796143390415,0.53711329543535813,0.16898010652108253,0.68694475790276877,0.52175608004857643,0.15991537179351101,0.83260371925826071,0.2483499564912921,0.85720425091048857,0.69111222516469606,0.544212361368828,0.31827031757819613,0.68195732771829476,0.74396676830072983,0.34484439182975479,0.15362755950759721,0.44968025577215154,0.36389832197446159,0.47158689325824521,0.61057719839939995,0.80765591307578732,0.6161820695412189]
[0.69704344155152609,0.25281576265392225,0.69560502059596907,0.46716486537405211,0.10685046523747144,0.81283172128639813,0.44942373320090867,9.9324930167590031E-2,0.89094293172749517,0.32221640643492055,0.41457782291156131,0.39251907797564545,0.69288888494368461,0.28078579099426504,0.20204078410987403,0.91471191087566972,0.57537781471545546,0.70880237420380743,0.22542623516277027,0.5958849886926284,0.17288529983201306,0.15764293876211999,0.58291438094378734,3.6820875123330432E-2,7.164390349535088E-3,0.97179159548205707,0.61266509528696567,0.66518090831122834,0.66233897772747174,6.5792767576253408E-2,0.6802722434376256,0.71147877588687058,0.71869385933447427,0.22226891607422172,0.4796013517370874,0.35010064972567467,0.35787779135538655,0.1192847154670158,0.61894710498501126,0.38837306060685839,0.12234393503675289,0.27207474278673605,0.72528292364146352,9.6994680619851947E-2,0.68720106005814607,0.31788223807133464,0.85776373357770686,0.98006667134340075,0.83221115664383949,0.67006162331779817,0.99935929032192905,0.59713333119176892,0.7596971233642682,0.50695410553753995,0.27883823785115314,0.61682398676278039,0.93037306925193242,0.86255845475520565,0.70812930230612769,0.21555248665086457,0.91348639196037495,0.93340395093231698,0.52029445211002345,0.51565532077560283,0.87518020862875245,0.24943157871060084,0.52475493465272505,0.69652602040946654,0.20915291914424772,0.26501004015599883,0.83153607723902467,0.95717246747901108,0.73333916635568208,0.7974119423509396,0.1700650099249239,0.93008921725692639,0.57214713660995831,0.62523448600331188,0.11908450485371047,0.76043017530175239,0.60266068146823948,0.26818786916172599,0.65324454290265577,7.6905240484782866E-2,0.34874936198611195,0.35638867318794254,6.8968136985556483E-2,0.45302656631681248,0.22239398921132014,0.63034536970854804,0.5684450144996166,0.99733007938684715,0.58432096596860816,0.31044221711245479,0.1783395577357616,6.4428069923820441E-2,0.5033222093534141,0.87239157621150742,0.70558600498671642,0.67270005141163758]
[0.67529420016325492,0.13705134562335719,0.54753742586764242,0.94007342823822637,0.36747423478499364,0.46037915755891479,0.7059832881122039,0.20895926497933548,1.4095766178627511E-2,0.50549068470806691,0.69881469241482885,0.44384035360606533,0.72949268377204424,0.64226499663588765,9.3118788799602115E-3,0.28746424004558446,0.29731801725504636,0.38221106545629469,0.64564551773079948,0.16139268282123376,0.34158421385533944,0.79631870197759702,0.37134532319426794,0.49808295363752941,0.23950905239144327,0.23036493387335477,0.80669970723353113,0.86136224136821005,0.62602279356911372,0.57086475372211043,0.97955774133031237,0.92498515479522891,2.7628567704563567E-2,0.76103248705965332,0.33657451732999377,3.9911120401667999E-2,0.9954312757553353,0.85528738598959253,3.0002308718789616E-2,0.72578973438490169,0.67286771827037706,0.45879841751627914,0.39678682794208275,0.84426531530544546,0.14450240133020997,0.59970356621642729,0.81578959777164051,0.93497627849199816,0.6285899819070665,0.68824768111838186,0.4947935947396932,0.61689718347716405,0.79763071832699883,0.7134788065728197,0.22381735635997457,0.84174086497636635,5.4566557734431753E-2,0.71642556087888476,0.32514869929484258,1.4464742416188558E-2,0.56378042828059538,0.49255895501725333,0.57830078593459078,0.44350590246364607,0.99229065016057982,0.392441607852829,0.75975368016075007,9.0214047056056401E-3,0.75846240734016213,0.26879041080472499,0.29553454378241173,0.55691777960722322,0.67973456611546734,0.502145239716974,0.63984658844990794,0.43308005980334674,0.88512825915978166,0.56557298207627771,0.76446124858205067,0.94776410791284793,0.3994454967244947,0.68283342347444675,5.2309871564244048E-2,0.55534246923601083,0.69945251767164951,0.80527465589165037,0.74621798104156423,0.36200310992110452,0.73437972817583519,0.6260210153778859,0.61908495931300311,0.43718064036139148,4.3806649760660399E-3,0.88178292524942825,0.63097537144709026,0.28311314708177737,0.23625677685869562,0.15199697458317052,7.0213318277615122E-2,0.7843256250747862]
[0.98818586909186468,0.78141794820816279,0.50012475805300394,0.77098739904153224,0.6550498083468046,0.15312456800219598,0.21882482053419161,0.93138010729368781,8.5496721763429706E-2,0.98325613101271758,0.61118279013006538,0.43173160942569822,0.14067268658077636,0.80288211499104678,0.96607311050713462,2.7121020188164424E-2,0.25725632978237878,0.8894228407448832,0.4894575371955675,0.4929837462229858,0.80061158958995204,0.23275824497094688,0.74795302972420497,0.18524318025243403,0.72007218388625804,0.69483335943256186,0.37641648789880255,0.68057215188678433,0.12233852638873033,0.3158477763322205,0.56517747430715015,0.16094797869793342,0.83286013359331645,0.61570867678421148,0.48712296768395669,0.372037404766417,0.33957289859291784,1.6910209276045918E-2,0.53421511927564391,0.57234787270525311,2.6664232454349235E-2,0.9163561705922364,0.42085667657522852,0.52641769384169368,0.61896456808582812,0.62723607234822931,0.5239437862069658,0.81455082181653704,0.63971469697386019,0.25059015036781984,0.35886007559084165,0.48692787406273419,0.13916433795042515,2.9901373080655769E-2,0.10399003632226023,0.81110487639556761,0.37777712864676405,0.4374314588030076,0.1022754666243918,0.71425093994584965,0.2321016414917253,0.6563560301837531,0.43491039945126819,0.87865393949103154,7.7376776197097374E-2,0.500019005655992,0.49325975302818126,0.54903424616760632,0.3459806391392547,0.18970747972332835,0.97369739317720305,0.97215680929593218,0.96969497023124962,0.40935040043785742,0.20666911463372972,0.68300661935069673,0.96731553906633461,0.14176293199585654,0.31565199308404901,0.51756044053941808,0.13795930652465282,0.75255245596408227,0.27857378526444276,0.73081910940003958,0.99350974551725824,0.64606075733187796,0.71728776490394464,0.8324799505512771,0.56630065418594289,0.83762709975943794,0.50491725128705311,0.95298939780578951,0.77165930961585494,8.0113623302370485E-2,0.69554155372274606,8.0734884768057014E-2,5.5324764031548623E-2,0.45659546013558217,0.66153691568576301,0.87522911599217434]
[0.10038914216860462,0.10131801128712625,0.33449956136579473,0.86334044240304297,6.4872570383120443E-2,0.57955687543856815,0.67483464041202346,0.20918802188534091,0.75685574845178394,0.17191694806169011,0.47007233565331108,7.4409911477128943E-2,0.68291462343551856,0.83858127913235614,0.37236792915698369,0.56820882315934995,0.13099551997848013,0.20386212665118253,0.50070425503796534,0.83767244716746947,0.90842718512435949,0.59413701753704173,0.62367313909142519,0.6469039290543136,0.4353859982658238,0.41005580510486617,5.8245747907363588E-2,0.23915676497175475,0.8257633405535415,0.2529731598736713,0.65039485625587823,0.47363731127447961,0.30662693555886766,0.32970185353260995,0.62467910992296261,2.4320502323994186E-2,0.18389339274927996,0.27172093962812915,1.3000234353059525E-2,0.41662228120299527,0.10853592766226849,0.97618767435302012,0.24675091659913384,0.14460077939821514,0.55768204407142019,0.56116464581785364,0.57494060074401598,0.6753871651662382,0.57601636816828528,0.28867448618335256,0.97893146166811784,0.74770217336179623,0.56655133328141938,0.22277281242485059,0.97150887441777367,3.5502765405634351E-2,8.4834222092575851E-2,0.49715429262075539,0.98983601713461478,0.28981359769135417,4.7135842194043431E-2,0.31821978106023308,3.5478237353197883E-2,0.198154983828841,0.49495881480416926,0.16123169988675146,0.10249327747829806,0.7499912827193268,4.9569855975089672E-2,0.56472761171393937,0.67781469049954779,8.8169557934580811E-2,0.63221746824945413,0.64145346844293749,0.77338217405444509,0.80887960945955384,0.3397617000959483,5.8160560663885863E-2,0.14479254283369691,0.74275115212603715,0.30905401616399941,0.6244381266004857,0.755656227880666,0.16613539709870051,0.74712814409976958,0.56150045728976705,0.56857001848551358,0.66022714514430281,0.41699400412513232,0.63772549792027844,0.4042215469942122,0.40510460702046358,0.89777460273942522,0.11646641861276052,0.14252589884700162,0.36205074966350859,0.98493573791649602,0.75578274496839193,0.53382902527309184,0.5331150155245632]
[0.7024636122587925,0.18850602412197626,0.99363644032875065,0.88282530504036161,9.2486396205537114E-2,0.10840757632531595,0.42956229911482735,0.30415741040301114,0.30124457811206196,0.59730460185500189,4.2957205654736041E-2,0.91426275865634943,0.98951488659044629,0.77970173921696706,0.49446224770527569,0.51154594225662564,0.85028427184136413,6.8151411998466416E-2,0.74345058552154086,0.43306201407775513,0.7573564208386121,0.26207535459423448,0.43366518204550975,0.66934064377203339,0.44154579316961906,0.49776996411957131,0.67532275291969002,0.50486113789477016,0.51503857901917538,0.34911021829041045,0.44253748337333398,0.32374474561594668,0.25576555748596475,0.77214290729586321,0.5286572302328193,0.5351701734918981,0.42578571841749013,0.65568138066313297,0.16632477686904368,0.95314752419290572,0.87042510722878863,0.43352719477812551,0.86637659510546627,0.79618664508180392,0.53662177057889693,0.68791822001846215,0.18519475265468965,0.85187364684219435,0.50406275616198304,0.81869513288106799,0.71708033162582163,0.70174622538182441,7.6772678998627719E-2,0.17617429637813009,0.49675290899164193,0.39196404688646957,0.23718635000317123,0.96940414594860735,0.56151166453599433,0.76364907482923283,0.33751955898654584,0.80030186930695923,0.51193154289769238,0.97094134366754237,0.83821650158642225,0.69806953010287309,0.46302364006752472,0.36473915815696356,0.68642037234253606,0.93706516976696697,0.4369672326967079,0.14597290428582643,0.533945463978033,0.11439465118074987,0.23843991395822062,0.38844049205892905,0.30272987578099231,0.60724054062857646,0.4181389027512975,0.11168124014230485,0.50023379808879254,0.74279964713509206,0.77908683121858857,0.58657423968909839,0.25087520493746351,0.53416255044861682,0.54320532432344526,8.1553048255789462E-2,2.1868305930645815E-2,0.51595944968504881,0.90637782216258633,0.69359286595714675,6.2223253986847249E-2,0.49172250495401637,0.37934125803136309,8.5450212719837437E-2,0.14744063211179359,0.90477133156199174,0.82254372724991187,0.89827497992379457]
[0.95881881625773258,0.10636568542221903,0.58339953483436569,0.5195764355886866,0.53205506017353998,0.35758135294902482,0.99197949005953268,0.19208538090496929,0.52283811099219724,0.79289637111478439,0.92799834363766875,0.89590821798114717,0.89609751141940519,0.7145475198613479,0.84682047672700755,0.79562681173500271,0.78458263021543795,0.78883486849955975,0.74568265674161838,0.52963629504470644,0.69742494952150513,0.67323354425486481,0.92963900018837853,0.63460569142320056,0.806688543109219,0.20107765060257254,0.85338416731573563,0.52746793711824691,7.0938840719626861E-2,0.64427397283846932,0.93970367527082577,0.78581787734808228,0.63908123859701893,0.80683304095281971,0.20030352254313766,0.58990983931742913,0.99628916648435928,2.8368103864954808E-2,6.4107669597469163E-2,0.13792059022389669,0.46380433227221218,0.14001225444406817,0.87167581488002088,4.9183498750560273E-2,0.17341836647384423,0.10446570471585381,0.1992692777245666,0.43828960780738813,0.73906756251192984,0.22249123174518415,8.6072706133826116E-2,0.54487832024985283,0.3782293008432045,0.44475844089633321,0.94710304577322602,0.67997118627606035,0.91947103947602093,0.1898199057747455,0.77238608111735541,0.84649370504243504,0.76246345964572715,0.25993753124307672,0.69371988585559963,0.94359253713921099,0.73285486276292855,0.71558409385824595,0.80152681056698694,0.26335662233333756,0.9209700832240737,0.13007319314386045,0.71483706654879287,3.4655698965880166E-2,0.69150926273753854,0.27650794150521707,0.28289802785487972,1.7275149223510478E-2,0.19123793278986212,0.33672033067340046,0.88217016745436194,0.46060128774448428,0.38746279961802399,0.39716793708790465,0.40981169203014944,0.51066398488794873,8.2568807840436298E-3,0.66014046721667974,0.57863635937664337,0.29591615585535913,0.20156232012032282,0.43955319014287753,0.22638406854270854,0.53561689201868723,0.80405025116137463,0.59168023566622441,8.9724510391948065E-2,0.62228349706768371,0.36103439878756238,1.4520064428256929E-2,0.16680060857919865,0.93889367569433635]
[0.1855977972795112,0.9477678379213138,0.79402630757689419,0.61775209990580937,0.55715873633042867,0.41218919681667732,0.11197761804866291,0.26341105782367968,0.28883106208011677,0.7474328469296333,0.26709298340556709,0.17647859008672073,0.25165573165364208,0.83043530295874701,0.99422263589331339,0.44362102106974355,0.98640671053887652,0.50626852017514135,0.56277628224867948,0.96316337676753272,0.50002892507344698,0.34053452226519199,0.30586287059489059,0.73913941214099277,0.3852806288591053,0.59185801931090498,0.32971278837198004,0.28242781656971527,0.73768377296515497,0.32059393866447339,0.55367847768195899,0.97299439712929559,8.4984365162917186E-2,0.34483658502030623,0.57940350001392138,0.39452168029632917,0.50434558752828396,0.77641257229120975,0.70868418828637558,3.8286789511630448E-2,0.67509460983662406,0.95740570535922542,0.39681957559469061,0.10137369655918405,0.23586705318916645,0.59646202592544539,9.8967041289505953E-2,0.9455330106032328,0.70510851024298193,0.74611436223332561,0.90414282056890349,0.79939967519744992,0.1175130007116868,0.38812332918721992,0.42674212821195689,0.85704175812318228,0.1464208850125378,0.99815604769556288,0.71793575580694891,0.98866075140063803,0.1717361226376386,0.3388174061431648,0.71922621390647934,0.32478564286497891,0.38445961857403665,0.84090092977303887,0.5741563279461771,0.39214682182180982,4.8871864066023618E-2,0.54408629952835486,1.4549961520221477E-2,0.94722145390527646,0.7948397221491007,0.71832715531171509,0.48561756197873907,0.34184788800275345,0.4402581285450049,0.52754534909160566,0.26553301474859936,0.83958389606887251,0.96495483445165842,0.26930564736777662,0.7792489734662652,0.54682181291270693,0.4339846280055728,0.35981247807071837,0.80715506337567,0.78131842990891831,0.7570358196587843,0.2030171182279904,0.15246903964214409,0.30433641557914981,9.4979469920381643E-2,0.9954743320493421,0.27072660887191136,8.616481611814486E-2,9.0676949354876024E-2,0.37560868550928517,0.88302267903694898,0.20229196712398545]
[0.57081576417390167,0.40460110470017208,0.25329325764234567,0.65717658767508769,0.62510092657171756,0.8946148424223247,0.1817219874517968,0.52537812071036538,0.70419691954010211,0.34417493697575119,0.79230929438998232,0.53536595571440648,4.5192300550931597E-2,0.34435793585543817,0.16445456843198336,0.42911821843140752,0.42150283715553227,8.9931936973885129E-2,0.57455217213933474,0.27865148757667657,2.6960473877202462E-2,0.32414323586694649,0.74973689261414556,0.86032498865444174,0.16265676674888552,0.13306028970239203,0.56861792071322115,0.77040606683604307,0.51350007076356419,1.7489285189632664E-2,0.76868517578932627,0.58693555274509113,0.76717970718182715,0.50676337479538491,0.69177245053666947,0.21433587039945845,0.32498585148620884,0.49073395835621703,0.64400695056812562,0.73546261654320355,4.6162001629808103E-3,0.98245891505525307,0.54367137664046372,0.74008580644046207,0.23043741035526288,0.61665452162475187,2.7377344844476403E-2,0.44583366969661087,0.33324608888285379,0.54953028663655157,0.5132909703487194,0.6046432715434209,0.986401108802893,0.33374294785309455,0.25219757082432037,0.68777766703477905,9.4790826419170915E-2,0.58847568161427788,0.14074134984799314,0.21945812047709679,0.67973451312235444,7.4197106495827447E-2,0.35114781320935229,0.22438796745825618,0.95543650712606831,0.55174893513419199,0.44722502088441862,0.5095838643954429,8.6720143610704126E-2,2.8177440222694528E-2,0.68593722897316323,6.5924078790867702E-3,0.65036492966962789,0.98848458293569319,0.67576022783740564,0.16285706736340644,0.20021239829590298,0.10671959103525186,0.84754854047808315,0.39593127365387148,0.61334846272687193,0.61278818943472457,0.3809047753115572,0.85765107497161619,0.87196829847948887,0.76612721854196331,0.64300327477820207,0.60601501834018967,0.4724093354250688,0.34813495781529513,0.16808125984875522,0.11168224910502844,0.41473900569386823,0.77278183087967067,0.44086620274055555,0.20997032611646571,1.6183753434599879E-2,0.1688828909750304,0.97726743649881109,0.89837621436335957]
[0.21649368391838619,0.59765956601681136,8.2032000728173848E-2,0.65355508422905872,0.35258052912615889,0.18291851566627848,0.90741033112937597,0.7154073296741329,0.48553387487750443,0.75164369409030996,0.44240124008425286,0.21619685746388295,0.60476103385190771,0.40742034997315058,0.5378727989915898,0.70755011366861043,0.60453819948617071,0.81608704761206918,0.94530562095065418,0.83546062624166939,0.15497577160940934,0.86434256507891472,0.98092452642830519,8.9469861145733742E-2,0.28535224822585237,0.50223460192015712,0.20556641040440204,0.44767518672128293,0.7346339775580053,0.44604766579861665,0.89392721433893962,0.57249714661750295,0.17279013226186501,0.49004735040648173,0.9257879776875011,0.73293181033582944,0.87034286189676524,0.43450251312064381,0.7350995385843766,0.66674887178954756,0.15643849477785221,0.90089591634312327,0.67140563206577752,0.30070729720585965,0.24925556485576361,0.30549265840726092,0.37760140016722432,0.10633593055416046,0.75406271611621833,2.0997438278447467E-2,0.12477707134667282,0.24407698817359591,0.9379437044115998,0.93762053534374101,0.34775858182185537,0.34472261221458178,0.4658222401134009,0.95568722892909619,0.59749703731066994,0.91191190545517187,0.20347423253411534,0.15283867412278895,0.75401800150400977,0.91473330723587143,0.20363645747461578,0.36999833332130261,0.66483990501207357,0.21448730443102404,0.33279092599335913,0.17896791313337534,0.16325812466864265,0.14950735469980947,0.62979151617566909,0.6121441831691472,0.88140596738432997,5.2937460449566265E-2,0.96871947973330985,0.31998393356263299,0.21772057428791958,0.61937512761574909,0.10873578182798316,0.32344874439134197,0.11597412016406683,0.66981889672677564,0.12612289308269897,0.15956297419823828,0.69093340465891295,0.49048472578211022,0.44415700734059749,0.84696092869336015,0.98587393411973689,0.75555042887072177,0.66365838287096801,0.13704480128283292,0.41205668803996476,0.30632751431043292,0.1013827019197836,0.21187462890865794,0.11449616893689296,0.31631244502987677]
[0.95977650462133357,1.1738583276426073E-2,0.23056369360416695,0.23826846462257834,0.81879848842845404,0.84193090742099241,0.35553605929575216,0.66831571468232842,0.75521172485573684,0.423526129889783,0.65523791823771793,0.54449256636381715,0.46543400387270806,0.87865439495358966,0.79108249670352282,0.51486625324768498,0.16328334591884364,0.97246536717017518,0.48958322763662998,0.92409567831309891,0.62420148811040999,0.96317269434737707,3.7543448314063976E-2,0.81980640922650283,7.2904716484426979E-2,0.64528762715615151,0.67208969289186316,0.95503392930852438,0.30497176980779861,0.45614231141460349,0.49938570205549837,0.83923771196142916,0.73926200782258555,0.93412163722058528,0.19235717359462978,0.4659784917939831,0.6896696350706083,0.53874474831258401,0.66271529737525947,9.6009450519551454E-2,0.26046558048046986,0.61365022309589745,0.60494523412895074,0.65768267617212595,0.69054519777868839,0.11543349737987962,0.46076419407114877,0.91053797693707617,0.35567857824430216,0.28144070138340238,0.67252207751344273,0.59580837564073608,0.69548694546764822,0.90012936269841815,8.0884474850222765E-2,0.93443219398683253,0.44341773845442922,0.88790293055484149,0.61101595297572309,0.33194777074176429,0.96686709437116936,0.34482803055187361,0.37566601813754286,0.50467146733451496,0.45084404390195987,0.92005141505411403,0.95213220003950316,0.65951016205675506,0.17102026872530485,0.59297662259907058,0.80917605318498875,0.47565485961906084,0.11934655058152044,0.63591986531372846,0.25969409858001347,0.81722027199412517,0.38120104826062284,0.48193740925978701,0.77677473583268886,0.98690584681647486,0.44893629735101859,0.45378287235126857,0.21209007331316143,0.68831407454990168,0.27393957879374276,0.69890867448073246,0.54854712679580053,0.31471831722448373,0.72481180117665522,0.51646863169888202,0.18727225598864095,0.37618052837215166,0.68359290227165181,0.39149011698489622,0.34854035554853036,0.80457041912137506,0.64331072035474746,0.93255694688721491,0.50325121806372319,0.9909603316191643]
[0.34164119371754398,0.11898603354620185,0.104725429519825,0.13252951402739455,0.51917779637900274,0.54268847874320303,0.23948912397941724,0.62012811376786692,0.30142696104898037,0.46614755827028809,0.51583338898420106,0.85824060297612259,0.52781979463545858,0.95623888706369697,4.9808737517860524E-2,0.50621076605436999,0.59357362540069647,0.35883689425726262,0.19826027570127536,0.52531818530141727,0.62519820983146446,0.65481932519319053,0.31974400380166756,0.44196487804964157,0.17155265582766521,0.23371617606908335,0.97088437008890682,0.41229451377033421,0.96353777002277818,5.2602986585268074E-2,0.71423254931239999,0.54162061963409835,3.4006478764949555E-2,7.5458490045475779E-3,0.19270579117559994,0.63985579432533468,2.0697476473789722E-2,0.15536500159174327,0.97561033446344347,0.18954443911622021,0.93693252645470004,0.85882939744826881,0.34027465534273782,3.3151383280342506E-2,0.25704087414094923,0.27249689690979928,4.0880161995904385E-2,0.93453167743316823,0.16369046521337693,0.79822363777687722,0.84196605327843965,0.30762718349020557,0.8400215649313969,0.17160154490105417,0.60252725495542747,0.58392077825762123,0.33688002817431528,0.75103296840846401,0.16575615035242452,0.77028656660986228,0.58180165340107437,0.14537723157804416,0.10825406101470059,0.69352058790479787,0.99347413657596417,0.83192010275800077,0.11942694757445438,0.5140664459242601,0.85467671348480911,0.18952012202600776,0.68358578145763171,0.38613535046794734,0.96187094889130687,0.95340380904671918,0.54444332011528751,0.25687543179152117,0.44812140045126314,0.34727643838534317,0.34831913912437529,0.20036502140842771,0.56616717196371058,0.71255573307477005,1.161669327568382E-2,0.22996241895152769,0.75660339432642854,0.78406787415560997,0.21685498906986511,0.16423124884115237,0.84313869514189621,0.84574480605423585,0.19876412784771613,0.320845836433158,0.39840893917780118,0.99819226942901629,0.35516774569678333,0.99464084557041343,0.59141613430439088,0.23158733346815585,0.78573948685997008,0.48455061106661335]
[0.64793410451522226,0.51183785159678052,0.61534633952472217,0.36405517003918941,0.35667145713268478,0.34863357171819132,0.67247236180995074,0.43716916631544445,0.67897821068300623,0.55193533617141666,0.77063882501089498,0.27645098036196258,0.40218336769377272,0.28059350292890106,0.96158088059161817,0.21813422431745177,0.74042491824690715,0.62037641618447281,0.6649342788483168,0.4221769839311359,0.93030999385823387,3.5848058152144868E-2,0.41993206319709464,0.814188342327681,0.74941868637245546,0.96276575989428048,0.27238455497767811,0.83425052228053087,0.74271476423457983,0.87115324745907952,4.7516684720160685E-2,0.13349511420141025,0.26127994974037916,0.51455064642349979,0.13137785117999079,0.64241355976643744,0.79939025875500647,0.80689367383739696,0.74457304287988457,0.72393368809703229,0.61064853480830394,0.20825419728084538,0.67604849074501516,0.9626835413458027,0.75495773865340443,0.44516565750851211,0.27182148900754866,0.48067773227880028,0.35290190988646131,0.52309365735523428,0.68130806252632903,2.9202152430421346E-2,0.40542335486799985,0.44948942441608508,0.73681659746283923,0.77997389509674031,0.68946614530613537,0.67211287254166785,0.29552324808386632,0.96061334117511499,0.18664582748804648,0.33637911745673177,1.1153629201843929E-2,0.23235700208870325,0.59731374529155012,0.50184534421599125,0.95943102287146675,0.91339453803761528,0.12154273559038675,0.90724811497597568,0.79844148572998541,0.73228315500205565,0.32484042011311876,0.49635822996890178,0.22702475911783448,0.53232354953974692,0.5240851206639241,0.40693292719095275,0.67409521606899614,0.19508653618134131,0.25895905123174601,0.89136459579899385,0.47482865252229867,0.23937067612455687,0.30291363544274019,0.32037876022710354,0.42652054528455996,0.76198860359508336,0.81519627159981933,0.23214461738899628,9.8753379716419176E-2,0.57819537630933726,0.40233105839473116,0.33119381830258476,0.75968837061896943,0.89524244656528362,0.12011145880630314,0.15887946621632798,0.72684558435700963,0.90020799375790728]
[0.48646667072271532,0.73995728335075905,0.504421564675548,0.5204012546959913,0.67076571450901357,0.40005634667684709,0.75688846792593256,0.46520409964625353,0.43260274983629088,0.56688563219858767,5.5402294525508378E-2,0.9940276141231561,0.13516629416408943,0.73121689464348139,0.24922353229158212,0.53291040920010835,2.1443916445906597E-2,0.43151802496529656,0.96642896092269692,4.2118060848552408E-2,0.1771186233790174,0.87946851713826357,0.83517678308538601,0.5595593568851277,0.77414339559551926,6.0214678441655511E-2,0.43307884518530182,0.80206282755486891,0.35837729429725385,0.60231267269426947,0.84934917973151181,0.5020274371172665,0.23301077782643076,0.91076553565662444,0.56456079247590985,0.37402474210081404,5.2503273341613532E-2,0.7577267367775079,0.35790063120614535,0.57869470240086018,0.15958299971636569,0.61504086447175432,0.79580578812795921,0.19959551255282082,0.16721807801672961,0.48200250056356775,0.80510022676805393,0.51682644329446992,7.6169296080267679E-2,0.69491365027151453,0.47040440600014988,6.2943451176715626E-2,0.20578051579092271,0.39447216864355283,0.28570478354825579,0.46372231875940473,0.35576506272099506,0.26419814568186295,0.32581678764810618,0.52189970620223081,0.86786869751540563,0.96190198058031284,3.6926164542927964E-2,0.60647734580902368,0.89312076919730865,0.8519004486166688,0.72113996874001707,0.78784134578928122,0.70022148396623285,0.80759465345297343,0.91752594408497734,2.7007016951033913E-3,0.72731118328213551,0.73195824200752757,0.68802544782499331,1.0615225307777365E-2,0.8735053387145354,0.68470742242471982,2.8457210132263988E-2,0.11453144436990415,0.8885669145435392,0.92450493827530444,0.44295317956240876,0.10706188909209069,0.70545167641124273,3.2479959242175505E-2,0.466880424589044,0.38783237928865333,0.12696498327669425,0.77934928483831001,0.2899557062924506,0.11600387676711676,0.4583689663788596,0.62217903622949877,0.17517511146236764,0.82303638553110969,0.35448728620344783,5.5509544112182674E-2,0.96156451836314571,0.14187278557218752]
[0.53959542350525513,0.52637551333517052,0.32993363324720071,0.12988712395212665,0.53239291366940755,0.48787902996051336,0.73467834473421822,0.7989453365366882,0.85468378276692092,0.2664577641581255,0.62241482718651231,0.43141317759617215,0.82029730317017613,0.23201698957121131,0.3051936338619694,0.54367367652977416,0.24360219447152187,0.66816622207789877,0.67602249517173774,2.2072981251123669E-2,0.11074858036716595,0.83434523523540205,0.14261059952742672,0.32388212698010743,0.64681295635481539,0.64519762421524252,0.602731949191877,7.0297429542572787E-2,0.24132733656939465,0.81204507924094793,0.58879866399394187,0.41155935329134175,0.19082140845096818,0.72876348754044296,0.79975472672082204,0.15977276670992657,0.91570061149382909,0.92815862837184704,0.28297636793047842,0.34685997519544898,0.82314090679417451,0.53763280055917317,9.1165539577941823E-2,0.13054009397708233,0.3768957849795993,0.19813766402902333,9.4964790346301786E-2,0.91350571640352163,0.88624233268807751,0.5818339017723968,0.8236004050709208,0.60037851456952651,0.89745576338419719,0.74414702854619852,0.88999595862894698,0.94416006935091501,0.13828129662745847,0.48835067606258853,0.23156831733127892,0.63298156576965003,0.4189464077691466,0.27234044136183289,0.67973374923916552,0.85710493634349016,0.59282862345014042,1.3252115081838212E-2,0.80684916629953274,0.27934700244839039,0.67525883947568044,0.93583986908533912,0.54685352486417249,4.2539713813726454E-2,0.88667971163543169,0.59329671332728773,0.77277285075854107,6.9174623799900026E-2,0.49460959729182741,0.5185008879086892,0.71133843126739116,0.41820836845619314,0.16898087271875728,0.41637016114255143,0.66692654245817995,6.0229695867931365E-2,0.6432236890161066,0.39440983805620466,0.87360158496351104,0.26717229171396384,0.284351650552081,0.70883723020068634,0.15619238495406684,9.2073595276187858E-2,0.53379927002602978,0.30554010885465388,0.36190073623308905,0.39440261384319264,0.17807166977578714,0.65549170828365722,0.44843972277047051,0.41838558656459213]
[6.723913409278226E-2,0.80646200006383606,0.76887525681536084,1.9929956647640967E-2,0.91943074257824764,0.618368328348462,0.92299594079334679,0.14816231322185081,0.27476595434440543,0.75836082116142667,2.4821068499094823E-2,0.89170176486496155,0.35497910749706352,0.92120599545782444,0.52593935170392614,4.16827331270615E-2,0.88106518305554538,0.44918945777791286,0.40675843268417855,8.5639031279964306E-2,0.23077589535349496,0.36886426206990797,0.44419011821247978,0.91599171590492023,0.44647962266681251,0.39826993911796127,0.53513821261022287,0.28601290399956603,0.61709188876760201,0.92947194262139599,0.11737642815331117,0.86789491262792151,0.31849532301001982,0.75819771260813418,0.77750985194166444,0.83507713254133586,0.53354792683270025,0.69441671521913051,0.98013372542058042,4.118159080469197E-2,0.35503805436814595,0.73889773642557566,0.19120765894495306,0.94098871778596038,0.19659118206399528,0.21157765342722934,0.49460292986430254,0.29043345759863015,0.83880394476225628,0.123510452227097,0.78742323902557054,1.3617308483401258E-3,8.4994884803759607E-3,0.79884707844027358,0.26223784414016416,0.50697181607691666,0.82559758776862613,2.9482734972927638E-3,0.12854149892133837,0.6731714154324322,0.98556527622126633,0.51940498834000681,0.79924578958651515,5.9273062278951461E-2,0.19009780036524815,0.44723654038569016,0.92196300425772049,0.39435386400760053,0.34080237215513343,0.47364255232250319,0.72412954643001104,0.72205716423867039,0.14643470353036914,4.6131782227977536E-2,0.80405467856280677,0.3574619283808278,0.74742578569263363,0.64565992204778766,0.55144098582235201,4.6335605033907545E-2,0.82377990982162674,0.98980192004718814,0.39288732929840187,0.54828663267306377,0.63661649100632978,4.9966285300285684E-2,0.68192840713112168,7.4170537963171745E-2,0.62162255233980057,0.78722860537591799,0.29733666970757056,0.37411322751250609,0.46905391998885848,0.92730505569633814,0.95673587878232602,0.65532394972564023,0.15997603031737184,0.51966183342804884,0.72317136657446157,0.99531990607411946]
[0.7961670823280943,0.47576362084160861,0.86078073698988533,0.80120416377848047,0.35468753081408744,0.43407988077188397,0.18429047641657392,0.36920418939551591,0.52223578442727769,0.92351290892133442,0.57515293387143973,0.42106725366099684,0.44227294371695225,6.9760285639864472E-2,0.33964670907326944,0.58154405212325799,0.94836871262283118,0.80616684146515016,0.83528580734254576,0.51081537186398107,3.2858546328827787E-3,0.79464908124105127,0.40794279821573176,0.15322864172621675,0.2979810453106031,0.60576416307655601,0.90019817492385579,0.22043493750234144,0.85944266381034373,0.9079468832919525,0.32859343523752138,0.9771243396228475,0.93938207545119756,0.95547926550082252,0.60538143584665383,0.3661450285654001,0.13091589101771173,0.51387538554349632,0.43822829733345414,0.26073141463401106,0.440376425407217,0.49233264949144528,9.8029742724336955E-2,0.98972692673306073,0.33097511184728035,0.58961066376097349,0.39989163772476699,0.32237211774881325,0.52405694357402188,0.25745937532774354,0.25785351068570628,0.82617797159013795,0.85127416982600357,9.0465680309710361E-2,0.81854125682421264,0.18251125939656676,0.20925845150190647,0.93318018902321564,0.33693444240313575,1.2880698706899785E-2,0.42306316744322314,0.92883816012976173,0.10038317440161404,0.29845981364037633,0.14088101427961242,0.9121018529754209,4.0637411814208324E-3,0.99627854358856727,0.28027743114462844,5.6588633273628952E-2,0.55151215073264304,0.44247275738132774,0.3891787927727568,0.26241179481770449,0.58234304635464207,0.31657322559229173,5.8642198152860869E-2,0.39823357448586838,0.98874165723268925,0.34450881709957526,0.77624684648671483,0.34190458336135598,0.37251469173706053,0.44306969929089302,0.2415710540058601,0.41018685906419305,0.38128811386906136,0.23283938421085604,0.12330903017065242,0.83077261828419557,0.72207399923472626,0.26931260986050187,0.98278364671340745,0.55676803210502779,3.8858415827847104E-4,0.84047565862977569,4.1690651417900293E-2,3.7150045797007203E-2,0.33663938702956664,0.52366634530750777]
[0.37251449727249464,0.36761772860054609,0.85958860062375764,0.30019504152049403,0.68394404859990754,0.79845395623626214,0.86293729229930038,3.8071713417198727E-2,3.5217125946799599E-2,0.17669391618608177,0.35109658107579134,0.19641497876116076,0.26699988140951114,4.0945608179843718E-2,0.10425414116009646,0.82685196233369784,0.18040962479836398,0.83260749787128252,0.25795371079321028,0.90122703409260863,0.78883481801588273,0.60845479202503761,0.7974082595302967,0.16948030986362828,0.60782587981263503,8.9032392922047898E-2,0.59399784805966682,0.24984109381033226,0.36725814228830844,5.9667183423620207E-2,0.71882460322216246,0.37575360345208997,0.45700368717248774,0.11632467656524292,0.62399923543981528,0.20450682003626919,0.91730530298586288,0.1377979991172863,6.3466134166377586E-2,7.3861325450125137E-2,0.59350335537894283,0.70962692948930195,0.94671203602275189,0.46310837657916959,0.64574098172322403,0.17081481536564014,0.45536348301691876,0.62803821261004578,0.92873572941150462,0.19798810143070589,0.38052870090186874,0.12357934894197442,0.13967258889056555,0.38177108855304287,0.81123611067916379,0.67315860840123132,0.54605431589286069,0.71187371776435238,0.76739102162545636,5.6740174271485699E-4,0.81004519197328895,0.35031061164137078,0.25627130561240741,0.34848337909282878,0.45073182153185809,0.87135767219779892,0.42230402425538183,0.6099615415465971,0.50833500090078587,4.4677024201582372E-2,0.84048095670224332,0.44504718328404158,0.26633505747938957,0.66496840635614884,0.67370424102561055,0.85091023551371281,0.62890488348387896,0.1420588090557886,0.83078375929568982,8.1850144713182305E-2,0.15876544562755501,0.97592562917309844,0.39698076008885419,0.98900906180569859,0.34110443084252073,0.61848477536823754,0.13095617831266759,0.11232922002373102,0.57025812778232488,0.66563573523946551,0.74847489591614436,0.89222116485509007,0.86135254519505566,0.56898390372964036,0.440658226514548,0.18420461166823798,0.80255527458128106,0.61041080648983059,0.32630836082515335,0.11600522467009]
[2.3326196560677914E-3,0.58549121087360023,0.5850907442610368,0.16209125946919312,0.78550567681236683,0.72393212129375262,0.82630991953494348,0.12944052307118237,5.0723531885381923E-2,0.13720058250572797,4.6152091157117159E-2,0.57965038015564618,0.24416565543359636,0.58893645405627171,0.79409574772514668,0.22855137207135534,0.44745484082691001,0.47637074080878317,0.20268277710350879,0.14382685241114601,0.14900981839962957,0.711477853517827,0.30173108215862132,0.35510728972857231,0.1729174553350008,0.64228121119013115,4.0633743056549099E-2,0.85022288079296537,0.53782428437588103,0.6085663394202252,0.81080736608509041,5.202794974429803E-2,0.65266064583234473,0.66185499943867221,0.13959430253293448,0.9463574875325732,0.15459178719109778,5.1268871291038631E-2,0.45791440428711461,0.52624839168135751,0.65589367226929807,0.9270310324287323,0.92495425539825693,0.34374485401583366,0.43536299236549014,0.27392569194175187,0.6872491901031188,3.6571286683964921E-2,0.53656445675250686,0.27112197004168392,0.21015147270404311,0.24058513615260346,0.22232768861504804,9.5120828871009699E-2,0.62920699910674605,0.86956662477779023,0.76083412279758411,0.13082014554526789,0.10714980540238828,0.49391697333607676,5.1212980256700957E-2,0.39979942559300663,0.19547580754674299,0.56902468901491554,0.35163395261009733,0.16135780424046009,0.79811276816005428,0.86579836705133451,0.23191290880937621,0.40381112948535391,0.4244530452838059,0.87674541776634263,0.65703183327296266,0.87731584225459813,0.40274963044533074,0.19528234489488427,0.57699178754933866,0.57560917409555468,9.2732626377233229E-3,0.19968544655678777,0.88439018072745446,0.68259549435607114,0.60240480925077,2.4689553865557823E-2,3.0594133500596699E-2,0.40387622426364334,0.9169964030754143,7.6806516723054608E-2,0.50319351097598131,3.3046301912151521E-2,0.83110355501270783,0.297144669728582,0.79056808825935443,0.52987339334509775,0.19696464108414569,0.80707095903254455,0.37347051384207453,0.88103613686486337,0.58861709470155144,0.84252195166305599]
[0.73124581500243879,0.63804329828122097,0.62771891347933617,5.2933027666885568E-2,0.39954315736321866,0.24065550917264045,0.456899270681005,0.88478100931358605,0.79693667651848499,0.61476078835921111,0.27137326158780151,0.1688875140535786,0.88202981585141504,0.37574119019104479,0.42975091949699284,0.30566612589395392,0.31576780241157176,0.18911238372313699,0.96962142015158237,6.5533163146954343E-2,0.57366961368220204,0.55258140951191814,0.60321169251174256,0.2174851608243128,0.81357838607641553,0.68110870265220425,0.2582964090882095,0.20299879331667425,0.70548496836578767,0.21274267816222014,0.47760297572856669,1.8147962785718619E-2,0.509798469499681,0.34198003832392043,0.88222472138951191,0.28138087853724925,0.62759871343973139,1.5170552041217755E-2,0.84242924082397352,0.9927778399641648,0.15604225933343641,6.0065896079954828E-2,0.77287949709128156,0.5221670502737098,0.69986854839327428,0.38612119091347552,0.39948872078870701,0.32278774534853127,0.75897963514004152,0.77477517573132937,0.11585817283865552,0.78244884852355467,0.95348906071160544,0.97684211048603853,0.92867687225011664,0.43477115864958804,0.5798451079133129,0.3880836626132923,0.34237653437756521,0.68605253057745608,0.67482219162966228,0.81532407827474607,0.37268299761523183,0.91742378189418716,0.34920590906886806,0.83561455824183417,9.8338569976254231E-2,0.98901641551420871,0.97201288943623387,0.90813609433909703,1.1539986050460249E-2,0.26663686912652096,0.13242464568122281,0.26541214577511985,0.85629623533531019,0.44775892151745988,0.65973937917130476,0.32740814177499389,0.7838681124238408,0.56238225847725432,0.21945681506490422,7.792284853435627E-2,0.19581494820363377,0.52521096131528633,0.29647028351177684,0.1982841151341489,0.86299079170563331,0.65166384350853301,0.29113807987471674,0.29531956600666709,0.76391492396744831,0.19980317382054547,0.91824778621219583,0.49470871548932838,0.79867068579278067,0.17784694706861659,0.58738472369480554,2.6998015461985325E-2,0.34373330806863156,0.82983370905381837]
[0.92055008148484274,0.261933150692781,0.70258166843159975,0.47447789767782467,0.90475047166680056,0.93944534231606358,0.79568977594114743,0.60031293383154849,0.56857930366469989,0.44694872318236045,0.76770231897236918,0.65845817139845242,0.52395781425429122,0.28793664311199529,0.91029898619647476,0.62877554063295693,0.13349138148822526,0.55919383311862936,0.15763429551125296,7.2717870999386092E-2,0.52815321451925135,0.48807736048028372,0.79101439920109151,0.21845817402344014,0.15915493285570304,0.63538115911820603,0.2488085055083803,0.38867618084920175,5.4872145243492598E-2,0.67641355288230876,0.61969361856505434,0.86350063028102564,0.84251090928566064,0.7246803611471333,0.70440562309968469,7.6102842967928908E-4,0.32766355564391092,0.14909057450013741,0.38975358596882936,0.93878338349037571,0.72725007723502166,0.21576361159049107,0.50247794397313605,0.50204517316659769,0.30877425871479247,0.13124399729390734,0.76859423295038931,0.19464654835176076,0.2922040422735549,0.6669659421090387,0.46515686052939842,0.59199327484666797,0.4041550725372095,0.69844890322505104,0.62481342033127107,0.80786627014250223,0.33130466937944258,0.73489223374798507,0.23013991847885396,9.6046270202677642E-3,0.58918514050786874,0.10463827967699102,0.67096252704609316,0.41278912933169509,4.1587480579169944E-2,0.39877376209910675,0.44391046717757499,0.92355529656375446,0.66311163519913208,6.8178575714447187E-2,0.78523389790170917,0.33781862627577608,0.68042156405031784,0.4464176899831368,0.67858393540125594,0.65710188071295172,0.60971462524147491,0.52218099332700663,0.90227482719550267,5.1992743184579693E-2,9.2774119751419026E-2,6.5275159916023617E-2,0.37413555053007519,0.83457215063494994,0.64196686703256822,0.37768704978288226,0.16816954686546759,0.73501878405538668,0.80757863981329492,0.73125270782630314,0.38209840830924813,0.15541878420574573,0.28650034814638525,0.90654936904933014,0.49463977521520575,0.71008208161051112,0.27756476110542483,0.15075349371300051,3.6747844959730491E-2,0.67061852993842064]
[0.70678587620060684,0.7065087317788088,0.15061942433329878,0.1875009668932569,0.53950170900358818,0.61344806890378956,0.53342102386077317,0.38044727242294818,0.77209066338451449,0.84721705447356488,0.85344851248356868,0.80762655809781059,0.15004803296959812,0.21845861269220002,0.93474641940183134,0.52470671447436723,0.37723518888297491,0.45195331073232847,0.35541100429471861,0.8114340420693632,3.1716049069751562E-2,8.3409511656044266E-2,0.64928227800175164,0.68659404219977938,0.26527056103799063,0.3188203887925436,0.95688080316239366,0.91901245051077463,0.56464840676565653,0.73909669496358099,9.9488544310107119E-2,0.51795345714028629,0.91674784638312412,0.68521225395234076,0.35350919582224605,0.73739844805295474,0.59788837657257965,7.8937311125496623E-2,0.80048210973266076,0.78739774981090094,0.97424356927101607,4.3843990032244262E-2,0.58719937254964172,4.852231671611118E-2,0.65497269447911988,0.6318081881368347,0.49752716590048174,0.96119743882881203,0.37662978990517892,8.7232247041391431E-2,0.8306676395354311,0.95487664216358537,0.59640764396854062,5.8692242390573912E-2,5.9211132430048163E-2,0.78236887990518089,0.3435850057206512,0.39566281509141188,0.64681019676475815,0.46285912327397405,0.27474030471447231,0.14466390113813787,0.28627479988740556,0.20324442837486212,0.62455278242450929,0.65494758030358213,0.43282795654313,0.81873714291180377,4.0962495303502378E-2,0.59250893444967612,0.22543938379442641,7.4894257729355429E-2,0.90051820470526223,0.48622599018992363,0.59713951157087397,0.78771840514412028,0.68558796920854692,0.71000695296153216,0.87853025013465735,1.3222610674333279E-2,0.4740063645663295,0.99798564912966092,0.35648339048200506,9.5320012898709172E-2,6.5522654921949308E-2,0.4840631072977255,0.58237455062763022,8.1628399412938868E-2,0.93903851945326222,0.4383759759409922,0.45225755134438539,0.28443706006456237,0.49649377168380449,0.23780621107251732,0.66564091176714324,0.49911005408257736,4.2165871168307945E-2,0.65551126897809431,1.8677636491922667E-2,0.51694055896953894]

{"sheet":"Parameters","index":1,"n_rows":39,"n_cols":5,"rows_kept":39,"cut":false,"hidden":false,"merged":[]}
["All scenarios"]
[]
["a",10000,"Var_a",null,"=a*exp(bx+c)"]
["b",5.4000000000000003E-3,"Var_b"]
["c",2.37,"Var_c"]
[]
["Spoilage",0.1,"Spoilage_base"]
[]
["Grapes per bottle",750,"Grapes_per_bottle"]
[]
["Price per wine bottle",10,"Price_per_bottle"]
[]
["Production costs per bottle",2,"Prodcosts_per_bottle"]
[]
["Scenario 1"]
[]
["Maximum sun hours",12,"Max_sunhours_base"]
[]
["Number of growing days",100,"Growing_days_base"]
[]
["Vineyard rental costs",20000,"Vineyard_cost_base"]
[]
["Scenario 2"]
[]
["Target price per wine bottle",11.465215333648837,"Target_price_per_bottle"]
[]
["Scenario 3"]
[]
["Maximum sun hours",15,"Max_sunhours_alt"]
[]
["Number of growing days",90,"Growing_days_alt"]
[]
["Vineyard rental costs",25000,"Vineyard_cost_alt"]
[]
["Number of workers",20,"Number_worker_alt"]
[]
["Overtime limit",7.5,"Overtime_limit_alt"]
[]
["Hourly overtime payment",5,"Overtime_hourly_rate_alt"]

{"sheet":"Wine production","index":2,"n_rows":107,"n_cols":17,"rows_kept":107,"cut":false,"hidden":false,"merged":[[9,10,10,12]]}
["Wine production - vineyard 1"]
[]
["Simulation","Total hours of sun","Grape production","Wine bottles produced","Production costs","Total costs","Total Revenue","Profit/(loss)","Rank",null,"Profit Statistics"]
[1,{"$f":"SUM(Rawdata!A1:CV1)*Max_sunhours_base","v":654.35607690800362},{"$f":"Var_a*EXP(Var_b*'Wine production'!B4+Var_c)","v":3663256.9520459962},{"$f":"ROUNDDOWN(C4*(1-Spoilage)/Grapes_per_bottle,0)","v":4395},{"$f":"D4*Prodcosts_per_bottle","v":8790},{"$f":"E4+Vineyard_cost_base","v":28790},{"$f":"D4*Price_per_bottle","v":43950},{"$f":"G4-F4","v":15160},{"$f":"RANK(H4,$H$4:$H$103,1)","v":95}]
[{"$f":"A4+1","v":2},{"$f":"SUM(Rawdata!A2:CV2)*Max_sunhours_base","v":586.49142249597139},{"$f":"Var_a*EXP(Var_b*'Wine production'!B5+Var_c)","v":2539287.4127031821},3047,6094,26094,30470,{"$f":"G5-F5","v":4376},{"$f":"RANK(H5,$H$4:$H$103,1)","v":38},null,"Average expected profit",null,{"$f":"AVERAGE($H$4:$H$103)","v":6481.84},null,"Theoretical expected profit"]
[{"$f":"A5+1","v":3},{"$f":"SUM(Rawdata!A3:CV3)*Max_sunhours_base","v":577.31097746970283},{"$f":"Var_a*EXP(Var_b*'Wine production'!B6+Var_c)","v":2416473.1287788786},2899,5798,25798,28990,3192,30,null,"Maximum profit",null,{"$f":"MAX($H$4:$H$103)","v":23288},null,null,"Total hours of sun",{"$f":"Max_sunhours_base/2*100","v":600}]
[4,{"$f":"SUM(Rawdata!A4:CV4)*Max_sunhours_base","v":587.89325548471425},{"$f":"Var_a*EXP(Var_b*'Wine production'!B7+Var_c)","v":2558582.4985413733},3070,6140,26140,30700,4560,40,null,"Maximum loss",null,{"$f":"MIN($H$4:$H$103)","v":-3096},null,null,"Grape production",{"$f":"Var_a*EXP(Var_b*Q6+Var_c)","v":2731442.3800475686}]
[5,{"$f":"SUM(Rawdata!A5:CV5)*Max_sunhours_base","v":621.91163918622851},{"$f":"Var_a*EXP(Var_b*'Wine production'!B8+Var_c)","v":3074531.911034931},3689,7378,27378,36890,9512,73,null,"Probability of making a loss",null,{"$f":"COUNTIF($H$4:$H$103,\"<0\")/COUNT(H4:H103)","v":0.12},null,null,"Wine bottles produced",{"$f":"ROUNDDOWN(Q7*(1-Spoilage)/Grapes_per_bottle,0)","v":3277}]
[6,{"$f":"SUM(Rawdata!A6:CV6)*Max_sunhours_base","v":606.22991691901029},{"$f":"Var_a*EXP(Var_b*'Wine production'!B9+Var_c)","v":2824895.4791262592},3389,6778,26778,33890,7112,59,null,null,null,null,null,null,"Production costs",{"$f":"Q8*Prodcosts_per_bottle","v":6554}]
[7,{"$f":"SUM(Rawdata!A7:CV7)*Max_sunhours_base","v":547.24244153794029},{"$f":"Var_a*EXP(Var_b*'Wine production'!B10+Var_c)","v":2054307.8905823957},2465,4930,24930,24650,-280,12,null,"Components of Expected Profit of Median (50th Ranked) Simulation",null,null,null,null,"Total costs",{"$f":"Q9+Vineyard_cost_base","v":26554}]
[8,{"$f":"SUM(Rawdata!A8:CV8)*Max_sunhours_base","v":593.76552236667828},{"$f":"Var_a*EXP(Var_b*'Wine production'!B11+Var_c)","v":2641015.8499482553},3169,6338,26338,31690,5352,50,null,null,null,null,null,null,"Total Revenue",{"$f":"Q8*Price_per_bottle","v":32770}]
[9,{"$f":"SUM(Rawdata!A9:CV9)*Max_sunhours_base","v":615.34096102083004},{"$f":"Var_a*EXP(Var_b*'Wine production'!B12+Var_c)","v":2967355.0590371531},3560,7120,27120,35600,8480,64,null,null,null,null,null,null,"Profit/(loss)",{"$f":"Q11-Q10","v":6216}]
[10,{"$f":"SUM(Rawdata!A10:CV10)*Max_sunhours_base","v":578.15889653618319},{"$f":"Var_a*EXP(Var_b*'Wine production'!B13+Var_c)","v":2427562.9559022509},2913,5826,25826,29130,3304,31,null,"Simulation to find",null,50]
[11,{"$f":"SUM(Rawdata!A11:CV11)*Max_sunhours_base","v":587.10170993171721},{"$f":"Var_a*EXP(Var_b*'Wine production'!B14+Var_c)","v":2547669.5711370935},3057,6114,26114,30570,4456,39]
[12,{"$f":"SUM(Rawdata!A12:CV12)*Max_sunhours_base","v":533.49954018315225},{"$f":"Var_a*EXP(Var_b*'Wine production'!B15+Var_c)","v":1907373.8169913993},2288,4576,24576,22880,-1696,5,null,"Simulation",null,{"$f":"MATCH(M13,I4:I103,0)","v":8}]
[13,{"$f":"SUM(Rawdata!A13:CV13)*Max_sunhours_base","v":559.34526605584961},{"$f":"Var_a*EXP(Var_b*'Wine production'!B16+Var_c)","v":2193052.1529622264},2631,5262,25262,26310,1048,17]
[14,{"$f":"SUM(Rawdata!A14:CV14)*Max_sunhours_base","v":592.59084259367182},{"$f":"Var_a*EXP(Var_b*'Wine production'!B17+Var_c)","v":2624316.1925128861},3149,6298,26298,31490,5192,48,null,"Variable costs",null,{"$f":"VLOOKUP(M15,$A$4:$H$103,5,FALSE)","v":6338}]
[{"$f":"A17+1","v":15},{"$f":"SUM(Rawdata!A15:CV15)*Max_sunhours_base","v":620.65820881791319},{"$f":"Var_a*EXP(Var_b*'Wine production'!B18+Var_c)","v":3053792.1360517642},3664,7328,27328,36640,9312,68,null,"Fixed costs",null,{"$f":"Vineyard_cost_base","v":20000}]
[16,{"$f":"SUM(Rawdata!A16:CV16)*Max_sunhours_base","v":543.33053830726635},{"$f":"Var_a*EXP(Var_b*'Wine production'!B19+Var_c)","v":2011367.2624040388},2413,4826,24826,24130,-696,9,null,"Total costs",null,{"$f":"VLOOKUP(M15,$A$4:$H$103,6,FALSE)","v":26338}]
[17,{"$f":"SUM(Rawdata!A17:CV17)*Max_sunhours_base","v":636.21289378486551},{"$f":"Var_a*EXP(Var_b*'Wine production'!B20+Var_c)","v":3321376.9484336129},3985,7970,27970,39850,11880,84,null,"Total Revenue",null,{"$f":"VLOOKUP(M15,$A$4:$H$103,7,FALSE)","v":31690}]
[18,{"$f":"SUM(Rawdata!A18:CV18)*Max_sunhours_base","v":578.73547163086164},{"$f":"Var_a*EXP(Var_b*'Wine production'!B21+Var_c)","v":2435132.9650617596},2922,5844,25844,29220,3376,32,null,"Profit/(loss)",null,{"$f":"VLOOKUP(M15,$A$4:$H$103,8,FALSE)","v":5352}]
[19,{"$f":"SUM(Rawdata!A19:CV19)*Max_sunhours_base","v":634.89101682656246},{"$f":"Var_a*EXP(Var_b*'Wine production'!B22+Var_c)","v":3297752.9255291573},3957,7914,27914,39570,11656,82]
[20,{"$f":"SUM(Rawdata!A20:CV20)*Max_sunhours_base","v":590.08094695532714},{"$f":"Var_a*EXP(Var_b*'Wine production'!B23+Var_c)","v":2588987.6422179937},3106,6212,26212,31060,4848,45,null,"Check correct simulation",null,{"$f":"IF(M21=M20-M19,\"OK\",\"CHECK\")","v":"OK"}]
[21,{"$f":"SUM(Rawdata!A21:CV21)*Max_sunhours_base","v":604.36949837129043},{"$f":"Var_a*EXP(Var_b*'Wine production'!B24+Var_c)","v":2796657.9226387604},3355,6710,26710,33550,6840,57]
[22,{"$f":"SUM(Rawdata!A22:CV22)*Max_sunhours_base","v":589.09422606655437},{"$f":"Var_a*EXP(Var_b*'Wine production'!B25+Var_c)","v":2575229.4444098501},3090,6180,26180,30900,4720,41]
[23,{"$f":"SUM(Rawdata!A23:CV23)*Max_sunhours_base","v":653.85043771655876},{"$f":"Var_a*EXP(Var_b*'Wine production'!B26+Var_c)","v":3653268.2491570925},4383,8766,28766,43830,15064,94]
[24,{"$f":"SUM(Rawdata!A24:CV24)*Max_sunhours_base","v":585.37236572380925},{"$f":"Var_a*EXP(Var_b*'Wine production'!B27+Var_c)","v":2523989.0060895206},3028,6056,26056,30280,4224,35]
[25,{"$f":"SUM(Rawdata!A25:CV25)*Max_sunhours_base","v":566.51271929159213},{"$f":"Var_a*EXP(Var_b*'Wine production'!B28+Var_c)","v":2279596.6015926315},2735,5470,25470,27350,1880,20]
[26,{"$f":"SUM(Rawdata!A26:CV26)*Max_sunhours_base","v":692.83781901984253},{"$f":"Var_a*EXP(Var_b*'Wine production'!B29+Var_c)","v":4509354.5894378154},5411,10822,30822,54110,23288,100]
[27,{"$f":"SUM(Rawdata!A27:CV27)*Max_sunhours_base","v":592.73461148945137},{"$f":"Var_a*EXP(Var_b*'Wine production'!B30+Var_c)","v":2626354.3768071174},3151,6302,26302,31510,5208,49]
[28,{"$f":"SUM(Rawdata!A28:CV28)*Max_sunhours_base","v":558.59556214142344},{"$f":"Var_a*EXP(Var_b*'Wine production'!B31+Var_c)","v":2184191.7454740806},2621,5242,25242,26210,968,15]
[29,{"$f":"SUM(Rawdata!A29:CV29)*Max_sunhours_base","v":635.52568758503935},{"$f":"Var_a*EXP(Var_b*'Wine production'!B32+Var_c)","v":3309074.4468241674},3970,7940,27940,39700,11760,83]
[30,{"$f":"SUM(Rawdata!A30:CV30)*Max_sunhours_base","v":579.80899860724014},{"$f":"Var_a*EXP(Var_b*'Wine production'!B33+Var_c)","v":2449290.5384806027},2939,5878,25878,29390,3512,33]
[31,{"$f":"SUM(Rawdata!A31:CV31)*Max_sunhours_base","v":559.49487735134892},{"$f":"Var_a*EXP(Var_b*'Wine production'!B34+Var_c)","v":2194824.6378799733},2633,5266,25266,26330,1064,18]
[32,{"$f":"SUM(Rawdata!A32:CV32)*Max_sunhours_base","v":585.43097079734434},{"$f":"Var_a*EXP(Var_b*'Wine production'!B35+Var_c)","v":2524787.8927246779},3029,6058,26058,30290,4232,36]
[33,{"$f":"SUM(Rawdata!A33:CV33)*Max_sunhours_base","v":645.59735998196766},{"$f":"Var_a*EXP(Var_b*'Wine production'!B36+Var_c)","v":3494029.1617538198},{"$f":"ROUNDDOWN(C36*(1-Spoilage)/Grapes_per_bottle,0)","v":4192},{"$f":"D36*Prodcosts_per_bottle","v":8384},{"$f":"E36+Vineyard_cost_base","v":28384},{"$f":"D36*Price_per_bottle","v":41920},13536,91]
[34,{"$f":"SUM(Rawdata!A34:CV34)*Max_sunhours_base","v":589.40567333614149},{"$f":"Var_a*EXP(Var_b*'Wine production'!B37+Var_c)","v":2579564.1486406918},3095,6190,26190,30950,4760,43]
[35,{"$f":"SUM(Rawdata!A35:CV35)*Max_sunhours_base","v":585.51367670768468},{"$f":"Var_a*EXP(Var_b*'Wine production'!B38+Var_c)","v":2525915.7449199008},3031,6062,26062,30310,4248,37]
[36,{"$f":"SUM(Rawdata!A36:CV36)*Max_sunhours_base","v":592.00820412532244},{"$f":"Var_a*EXP(Var_b*'Wine production'!B39+Var_c)","v":2616072.4189290856},3139,6278,26278,31390,5112,47]
[37,{"$f":"SUM(Rawdata!A37:CV37)*Max_sunhours_base","v":598.12550140789938},{"$f":"Var_a*EXP(Var_b*'Wine production'!B40+Var_c)","v":2703933.3835457279},3244,6488,26488,32440,5952,53]
[38,{"$f":"SUM(Rawdata!A38:CV38)*Max_sunhours_base","v":638.54352801957748},{"$f":"Var_a*EXP(Var_b*'Wine production'!B41+Var_c)","v":3363442.0367459548},4036,8072,28072,40360,12288,87]
[39,{"$f":"SUM(Rawdata!A39:CV39)*Max_sunhours_base","v":636.81075186647263},{"$f":"Var_a*EXP(Var_b*'Wine production'!B42+Var_c)","v":3332117.1211462151},3998,7996,27996,39980,11984,85]
[40,{"$f":"SUM(Rawdata!A40:CV40)*Max_sunhours_base","v":576.43872235254662},{"$f":"Var_a*EXP(Var_b*'Wine production'!B43+Var_c)","v":2405117.8747234014},2886,5772,25772,28860,3088,29]
[41,{"$f":"SUM(Rawdata!A41:CV41)*Max_sunhours_base","v":642.95787256906601},{"$f":"Var_a*EXP(Var_b*'Wine production'!B44+Var_c)","v":3444581.187249139},4133,8266,28266,41330,13064,90]
[42,{"$f":"SUM(Rawdata!A42:CV42)*Max_sunhours_base","v":620.87236421151351},{"$f":"Var_a*EXP(Var_b*'Wine production'!B45+Var_c)","v":3057325.7035429082},3668,7336,27336,36680,9344,69]
[43,{"$f":"SUM(Rawdata!A43:CV43)*Max_sunhours_base","v":613.24953632034556},{"$f":"Var_a*EXP(Var_b*'Wine production'!B46+Var_c)","v":2934031.1898209495},3520,7040,27040,35200,8160,63]
[44,{"$f":"SUM(Rawdata!A44:CV44)*Max_sunhours_base","v":569.25773184965374},{"$f":"Var_a*EXP(Var_b*'Wine production'!B47+Var_c)","v":2313638.8989248257},2776,5552,25552,27760,2208,24]
[45,{"$f":"SUM(Rawdata!A45:CV45)*Max_sunhours_base","v":606.00258920582121},{"$f":"Var_a*EXP(Var_b*'Wine production'!B48+Var_c)","v":2821429.8507535248},3385,6770,26770,33850,7080,58]
[46,{"$f":"SUM(Rawdata!A46:CV46)*Max_sunhours_base","v":624.34836150566832},{"$f":"Var_a*EXP(Var_b*'Wine production'!B49+Var_c)","v":3115254.8607335933},3738,7476,27476,37380,9904,75]
[47,{"$f":"SUM(Rawdata!A47:CV47)*Max_sunhours_base","v":628.80109519931511},{"$f":"Var_a*EXP(Var_b*'Wine production'!B50+Var_c)","v":3191068.2268369738},3829,7658,27658,38290,10632,81]
[48,{"$f":"SUM(Rawdata!A48:CV48)*Max_sunhours_base","v":527.10118185749093},{"$f":"Var_a*EXP(Var_b*'Wine production'!B51+Var_c)","v":1842597.3804689557},2211,4422,24422,22110,-2312,2]
[49,{"$f":"SUM(Rawdata!A49:CV49)*Max_sunhours_base","v":621.36720493716086},{"$f":"Var_a*EXP(Var_b*'Wine production'!B52+Var_c)","v":3065506.2304878514},3678,7356,27356,36780,9424,71]
[50,{"$f":"SUM(Rawdata!A50:CV50)*Max_sunhours_base","v":687.57331831837303},{"$f":"Var_a*EXP(Var_b*'Wine production'!B53+Var_c)","v":4382966.3014097279},5259,10518,30518,52590,22072,99]
[51,{"$f":"SUM(Rawdata!A51:CV51)*Max_sunhours_base","v":653.78336421321478},{"$f":"Var_a*EXP(Var_b*'Wine production'!B54+Var_c)","v":3651945.2862574151},4382,8764,28764,43820,15056,93]
[52,{"$f":"SUM(Rawdata!A52:CV52)*Max_sunhours_base","v":626.88214176499457},{"$f":"Var_a*EXP(Var_b*'Wine production'!B55+Var_c)","v":3158172.0010782438},3789,7578,27578,37890,10312,78]
[53,{"$f":"SUM(Rawdata!A53:CV53)*Max_sunhours_base","v":563.95137032990749},{"$f":"Var_a*EXP(Var_b*'Wine production'!B56+Var_c)","v":2248283.8993261741},2697,5394,25394,26970,1576,19]
[54,{"$f":"SUM(Rawdata!A54:CV54)*Max_sunhours_base","v":567.7157526262763},{"$f":"Var_a*EXP(Var_b*'Wine production'!B57+Var_c)","v":2294453.9345684596},2753,5506,25506,27530,2024,22]
[55,{"$f":"SUM(Rawdata!A55:CV55)*Max_sunhours_base","v":662.00410096906148},{"$f":"Var_a*EXP(Var_b*'Wine production'!B58+Var_c)","v":3817714.5538587985},4581,9162,29162,45810,16648,97]
[56,{"$f":"SUM(Rawdata!A56:CV56)*Max_sunhours_base","v":546.16586698265996},{"$f":"Var_a*EXP(Var_b*'Wine production'!B59+Var_c)","v":2042399.8136782618},2450,4900,24900,24500,-400,11]
[57,{"$f":"SUM(Rawdata!A57:CV57)*Max_sunhours_base","v":647.52968954875462},{"$f":"Var_a*EXP(Var_b*'Wine production'!B60+Var_c)","v":3530678.7664538026},4236,8472,28472,42360,13888,92]
[58,{"$f":"SUM(Rawdata!A58:CV58)*Max_sunhours_base","v":551.48457013252175},{"$f":"Var_a*EXP(Var_b*'Wine production'!B61+Var_c)","v":2101910.0789367706},2522,5044,25044,25220,176,13]
[59,{"$f":"SUM(Rawdata!A59:CV59)*Max_sunhours_base","v":573.6523829143041},{"$f":"Var_a*EXP(Var_b*'Wine production'!B62+Var_c)","v":2369200.7968295636},2843,5686,25686,28430,2744,27]
[60,{"$f":"SUM(Rawdata!A60:CV60)*Max_sunhours_base","v":621.67721442815457},{"$f":"Var_a*EXP(Var_b*'Wine production'!B63+Var_c)","v":3070642.3428872922},3684,7368,27368,36840,9472,72]
[61,{"$f":"SUM(Rawdata!A61:CV61)*Max_sunhours_base","v":573.46109752568316},{"$f":"Var_a*EXP(Var_b*'Wine production'!B64+Var_c)","v":2366754.8154506236},2840,5680,25680,28400,2720,26]
[62,{"$f":"SUM(Rawdata!A62:CV62)*Max_sunhours_base","v":557.82056878624121},{"$f":"Var_a*EXP(Var_b*'Wine production'!B65+Var_c)","v":2175070.0816234373},2610,5220,25220,26100,880,14]
[63,{"$f":"SUM(Rawdata!A63:CV63)*Max_sunhours_base","v":621.97906614648582},{"$f":"Var_a*EXP(Var_b*'Wine production'!B66+Var_c)","v":3075651.5691007026},3690,7380,27380,36900,9520,74]
[64,{"$f":"SUM(Rawdata!A64:CV64)*Max_sunhours_base","v":611.69877834030558},{"$f":"Var_a*EXP(Var_b*'Wine production'!B67+Var_c)","v":2909563.9280471089},3491,6982,26982,34910,7928,62]
[65,{"$f":"SUM(Rawdata!A65:CV65)*Max_sunhours_base","v":637.78686708618829},{"$f":"Var_a*EXP(Var_b*'Wine production'!B68+Var_c)","v":3349727.1550868726},{"$f":"ROUNDDOWN(C68*(1-Spoilage)/Grapes_per_bottle,0)","v":4019},{"$f":"D68*Prodcosts_per_bottle","v":8038},{"$f":"E68+Vineyard_cost_base","v":28038},{"$f":"D68*Price_per_bottle","v":40190},12152,86]
[66,{"$f":"SUM(Rawdata!A66:CV66)*Max_sunhours_base","v":530.08076513156698},{"$f":"Var_a*EXP(Var_b*'Wine production'!B69+Var_c)","v":1872484.1012563375},2246,4492,24492,22460,{"$f":"G69-F69","v":-2032},{"$f":"RANK(H69,$H$4:$H$103,1)","v":3}]
[{"$f":"A69+1","v":67},{"$f":"SUM(Rawdata!A67:CV67)*Max_sunhours_base","v":609.50477981460062},{"$f":"Var_a*EXP(Var_b*'Wine production'!B70+Var_c)","v":2875295.9986755196},3450,6900,26900,34500,7600,60]
[68,{"$f":"SUM(Rawdata!A68:CV68)*Max_sunhours_base","v":518.73228255394463},{"$f":"Var_a*EXP(Var_b*'Wine production'!B71+Var_c)","v":1761180.1776360327},2113,4226,24226,21130,-3096,1]
[69,{"$f":"SUM(Rawdata!A69:CV69)*Max_sunhours_base","v":532.91179632583112},{"$f":"Var_a*EXP(Var_b*'Wine production'!B72+Var_c)","v":1901329.7583119369},2281,4562,24562,22810,-1752,4]
[70,{"$f":"SUM(Rawdata!A70:CV70)*Max_sunhours_base","v":604.05590637531736},{"$f":"Var_a*EXP(Var_b*'Wine production'!B73+Var_c)","v":2791926.0786980744},3350,6700,26700,33500,6800,56]
[71,{"$f":"SUM(Rawdata!A71:CV71)*Max_sunhours_base","v":566.67722537410145},{"$f":"Var_a*EXP(Var_b*'Wine production'!B74+Var_c)","v":2281622.5418498409},2737,5474,25474,27370,1896,21]
[72,{"$f":"SUM(Rawdata!A72:CV72)*Max_sunhours_base","v":595.58504036723843},{"$f":"Var_a*EXP(Var_b*'Wine production'!B75+Var_c)","v":2667092.7779962984},3200,6400,26400,32000,5600,52]
[73,{"$f":"SUM(Rawdata!A73:CV73)*Max_sunhours_base","v":640.78341131910884},{"$f":"Var_a*EXP(Var_b*'Wine production'!B76+Var_c)","v":3404371.1393704512},4085,8170,28170,40850,12680,89]
[74,{"$f":"SUM(Rawdata!A74:CV74)*Max_sunhours_base","v":534.27061381943292},{"$f":"Var_a*EXP(Var_b*'Wine production'!B77+Var_c)","v":1915332.2928246811},2298,4596,24596,22980,-1616,6]
[75,{"$f":"SUM(Rawdata!A75:CV75)*Max_sunhours_base","v":598.38388332559157},{"$f":"Var_a*EXP(Var_b*'Wine production'!B78+Var_c)","v":2707708.7131828638},3249,6498,26498,32490,5992,54]
[76,{"$f":"SUM(Rawdata!A76:CV76)*Max_sunhours_base","v":654.97842030665527},{"$f":"Var_a*EXP(Var_b*'Wine production'!B79+Var_c)","v":3675588.6020675469},4410,8820,28820,44100,15280,96]
[77,{"$f":"SUM(Rawdata!A77:CV77)*Max_sunhours_base","v":543.53509162281011},{"$f":"Var_a*EXP(Var_b*'Wine production'!B80+Var_c)","v":2013590.2218535021},2416,4832,24832,24160,-672,10]
[78,{"$f":"SUM(Rawdata!A78:CV78)*Max_sunhours_base","v":640.7248111110797},{"$f":"Var_a*EXP(Var_b*'Wine production'!B81+Var_c)","v":3403294.0267731296},4083,8166,28166,40830,12664,88]
[79,{"$f":"SUM(Rawdata!A79:CV79)*Max_sunhours_base","v":618.0139189010165},{"$f":"Var_a*EXP(Var_b*'Wine production'!B82+Var_c)","v":3010496.3818478989},3612,7224,27224,36120,8896,66]
[80,{"$f":"SUM(Rawdata!A80:CV80)*Max_sunhours_base","v":621.05057991324747},{"$f":"Var_a*EXP(Var_b*'Wine production'!B83+Var_c)","v":3060269.382368851},3672,7344,27344,36720,9376,70]
[81,{"$f":"SUM(Rawdata!A81:CV81)*Max_sunhours_base","v":625.84348852801361},{"$f":"Var_a*EXP(Var_b*'Wine production'!B84+Var_c)","v":3140508.2568592075},3768,7536,27536,37680,10144,77]
[82,{"$f":"SUM(Rawdata!A82:CV82)*Max_sunhours_base","v":619.43083977526487},{"$f":"Var_a*EXP(Var_b*'Wine production'!B85+Var_c)","v":3033619.1594280074},3640,7280,27280,36400,9120,67]
[83,{"$f":"SUM(Rawdata!A83:CV83)*Max_sunhours_base","v":541.59610282798155},{"$f":"Var_a*EXP(Var_b*'Wine production'!B86+Var_c)","v":1992616.8388450891},2391,4782,24782,23910,-872,8]
[84,{"$f":"SUM(Rawdata!A84:CV84)*Max_sunhours_base","v":625.08469547056484},{"$f":"Var_a*EXP(Var_b*'Wine production'!B87+Var_c)","v":3127666.4067987269},3753,7506,27506,37530,10024,76]
[85,{"$f":"SUM(Rawdata!A85:CV85)*Max_sunhours_base","v":627.28696690907236},{"$f":"Var_a*EXP(Var_b*'Wine production'!B88+Var_c)","v":3165083.4929301227},3798,7596,27596,37980,10384,79]
[86,{"$f":"SUM(Rawdata!A86:CV86)*Max_sunhours_base","v":615.30402531880873},{"$f":"Var_a*EXP(Var_b*'Wine production'!B89+Var_c)","v":2966763.2708078604},3560,7120,27120,35600,8480,64]
[87,{"$f":"SUM(Rawdata!A87:CV87)*Max_sunhours_base","v":558.83578949782179},{"$f":"Var_a*EXP(Var_b*'Wine production'!B90+Var_c)","v":2187026.9781356589},2624,5248,25248,26240,992,16]
[88,{"$f":"SUM(Rawdata!A88:CV88)*Max_sunhours_base","v":582.78172357521169},{"$f":"Var_a*EXP(Var_b*'Wine production'!B91+Var_c)","v":2488925.574866971},2986,5972,25972,29860,3888,34]
[89,{"$f":"SUM(Rawdata!A89:CV89)*Max_sunhours_base","v":677.28996544346819},{"$f":"Var_a*EXP(Var_b*'Wine production'!B92+Var_c)","v":4146213.9946500319},4975,9950,29950,49750,19800,98]
[90,{"$f":"SUM(Rawdata!A90:CV90)*Max_sunhours_base","v":569.45932021728481},{"$f":"Var_a*EXP(Var_b*'Wine production'!B93+Var_c)","v":2316158.8447739384},2779,5558,25558,27790,2232,25]
[91,{"$f":"SUM(Rawdata!A91:CV91)*Max_sunhours_base","v":628.09196750172111},{"$f":"Var_a*EXP(Var_b*'Wine production'!B94+Var_c)","v":3178872.0687818886},3814,7628,27628,38140,10512,80]
[92,{"$f":"SUM(Rawdata!A92:CV92)*Max_sunhours_base","v":589.23210191257556},{"$f":"Var_a*EXP(Var_b*'Wine production'!B95+Var_c)","v":2577147.4928101939},3092,6184,26184,30920,4736,42]
[93,{"$f":"SUM(Rawdata!A93:CV93)*Max_sunhours_base","v":590.25267512515347},{"$f":"Var_a*EXP(Var_b*'Wine production'!B96+Var_c)","v":2591389.60714678},3109,6218,26218,31090,4872,46]
[94,{"$f":"SUM(Rawdata!A94:CV94)*Max_sunhours_base","v":611.61535218300412},{"$f":"Var_a*EXP(Var_b*'Wine production'!B97+Var_c)","v":2908253.4610679033},3489,6978,26978,34890,7912,61]
[95,{"$f":"SUM(Rawdata!A95:CV95)*Max_sunhours_base","v":573.87423252686358},{"$f":"Var_a*EXP(Var_b*'Wine production'!B98+Var_c)","v":2372040.7715233807},2846,5692,25692,28460,2768,28]
[96,{"$f":"SUM(Rawdata!A96:CV96)*Max_sunhours_base","v":568.29899521838172},{"$f":"Var_a*EXP(Var_b*'Wine production'!B99+Var_c)","v":2301691.7319485992},2762,5524,25524,27620,2096,23]
[97,{"$f":"SUM(Rawdata!A97:CV97)*Max_sunhours_base","v":534.42533056468687},{"$f":"Var_a*EXP(Var_b*'Wine production'!B100+Var_c)","v":1916933.1649557194},{"$f":"ROUNDDOWN(C100*(1-Spoilage)/Grapes_per_bottle,0)","v":2300},{"$f":"D100*Prodcosts_per_bottle","v":4600},{"$f":"E100+Vineyard_cost_base","v":24600},23000,-1600,7]
[98,{"$f":"SUM(Rawdata!A98:CV98)*Max_sunhours_base","v":603.24418163904045},{"$f":"Var_a*EXP(Var_b*'Wine production'!B101+Var_c)","v":2779714.9733178513},{"$f":"ROUNDDOWN(C101*(1-Spoilage)/Grapes_per_bottle,0)","v":3335},{"$f":"D101*Prodcosts_per_bottle","v":6670},{"$f":"E101+Vineyard_cost_base","v":26670},33350,6680,55]
[99,{"$f":"SUM(Rawdata!A99:CV99)*Max_sunhours_base","v":589.93760672633732},{"$f":"Var_a*EXP(Var_b*'Wine production'!B102+Var_c)","v":2586984.4447526941},{"$f":"ROUNDDOWN(C102*(1-Spoilage)/Grapes_per_bottle,0)","v":3104},{"$f":"D102*Prodcosts_per_bottle","v":6208},{"$f":"E102+Vineyard_cost_base","v":26208},31040,4832,44]
[100,{"$f":"SUM(Rawdata!A100:CV100)*Max_sunhours_base","v":594.27908571648027},{"$f":"Var_a*EXP(Var_b*'Wine production'!B103+Var_c)","v":2648350.1915126042},{"$f":"ROUNDDOWN(C103*(1-Spoilage)/Grapes_per_bottle,0)","v":3178},{"$f":"D103*Prodcosts_per_bottle","v":6356},{"$f":"E103+Vineyard_cost_base","v":26356},31780,5424,51]
[]
["Total",{"$f":"SUM(B4:B103)","v":59805.795797680017}]
["Expected",{"$f":"Rawdata!CY6*Rawdata!CY2*Max_sunhours_base","v":59805.795797680206}]
["Check",{"$f":"IF(TRUNC(B105)=TRUNC(B106),\"OK\",\"CHECK\")","v":"OK"}]

{"sheet":"Chart profit","index":3,"n_rows":104,"n_cols":3,"rows_kept":104,"cut":false,"hidden":false,"merged":[]}
["This tab is used to produce a chart showing the distribution of profit"]
[]
[]
["Rank","Simulation","Profit/(loss)"]
[1,{"$f":"MATCH(A5,'Wine production'!I4:I103,0)","v":68},{"$f":"OFFSET('Wine production'!$H$4,'Chart profit'!B5-1,0)","v":-3096}]
[2,48,{"$f":"OFFSET('Wine production'!$H$4,'Chart profit'!B6-1,0)","v":-2312}]
[3,66,{"$f":"OFFSET('Wine production'!$H$4,'Chart profit'!B7-1,0)","v":-2032}]
[4,69,{"$f":"OFFSET('Wine production'!$H$4,'Chart profit'!B8-1,0)","v":-1752}]
[5,12,{"$f":"OFFSET('Wine production'!$H$4,'Chart profit'!B9-1,0)","v":-1696}]
[6,74,{"$f":"OFFSET('Wine production'!$H$4,'Chart profit'!B10-1,0)","v":-1616}]
[7,97,{"$f":"OFFSET('Wine production'!$H$4,'Chart profit'!B11-1,0)","v":-1600}]
[8,83,{"$f":"OFFSET('Wine production'!$H$4,'Chart profit'!B12-1,0)","v":-872}]
[9,16,{"$f":"OFFSET('Wine production'!$H$4,'Chart profit'!B13-1,0)","v":-696}]
[10,77,{"$f":"OFFSET('Wine production'!$H$4,'Chart profit'!B14-1,0)","v":-672}]
[11,56,{"$f":"OFFSET('Wine production'!$H$4,'Chart profit'!B15-1,0)","v":-400}]
[12,7,{"$f":"OFFSET('Wine production'!$H$4,'Chart profit'!B16-1,0)","v":-280}]
[13,58,{"$f":"OFFSET('Wine production'!$H$4,'Chart profit'!B17-1,0)","v":176}]
[14,62,{"$f":"OFFSET('Wine production'!$H$4,'Chart profit'!B18-1,0)","v":880}]
[15,28,{"$f":"OFFSET('Wine production'!$H$4,'Chart profit'!B19-1,0)","v":968}]
[16,87,{"$f":"OFFSET('Wine production'!$H$4,'Chart profit'!B20-1,0)","v":992}]
[17,13,{"$f":"OFFSET('Wine production'!$H$4,'Chart profit'!B21-1,0)","v":1048}]
[18,31,{"$f":"OFFSET('Wine production'!$H$4,'Chart profit'!B22-1,0)","v":1064}]
[19,53,{"$f":"OFFSET('Wine production'!$H$4,'Chart profit'!B23-1,0)","v":1576}]
[20,25,{"$f":"OFFSET('Wine production'!$H$4,'Chart profit'!B24-1,0)","v":1880}]
[21,71,{"$f":"OFFSET('Wine production'!$H$4,'Chart profit'!B25-1,0)","v":1896}]
[22,54,{"$f":"OFFSET('Wine production'!$H$4,'Chart profit'!B26-1,0)","v":2024}]
[23,96,{"$f":"OFFSET('Wine production'!$H$4,'Chart profit'!B27-1,0)","v":2096}]
[24,44,{"$f":"OFFSET('Wine production'!$H$4,'Chart profit'!B28-1,0)","v":2208}]
[25,90,{"$f":"OFFSET('Wine production'!$H$4,'Chart profit'!B29-1,0)","v":2232}]
[26,61,{"$f":"OFFSET('Wine production'!$H$4,'Chart profit'!B30-1,0)","v":2720}]
[27,59,{"$f":"OFFSET('Wine production'!$H$4,'Chart profit'!B31-1,0)","v":2744}]
[28,95,{"$f":"OFFSET('Wine production'!$H$4,'Chart profit'!B32-1,0)","v":2768}]
[29,40,{"$f":"OFFSET('Wine production'!$H$4,'Chart profit'!B33-1,0)","v":3088}]
[30,3,{"$f":"OFFSET('Wine production'!$H$4,'Chart profit'!B34-1,0)","v":3192}]
[31,10,{"$f":"OFFSET('Wine production'!$H$4,'Chart profit'!B35-1,0)","v":3304}]
[32,18,{"$f":"OFFSET('Wine production'!$H$4,'Chart profit'!B36-1,0)","v":3376}]
[33,30,{"$f":"OFFSET('Wine production'!$H$4,'Chart profit'!B37-1,0)","v":3512}]
[34,88,{"$f":"OFFSET('Wine production'!$H$4,'Chart profit'!B38-1,0)","v":3888}]
[35,24,{"$f":"OFFSET('Wine production'!$H$4,'Chart profit'!B39-1,0)","v":4224}]
[36,32,{"$f":"OFFSET('Wine production'!$H$4,'Chart profit'!B40-1,0)","v":4232}]
[37,35,{"$f":"OFFSET('Wine production'!$H$4,'Chart profit'!B41-1,0)","v":4248}]
[38,2,{"$f":"OFFSET('Wine production'!$H$4,'Chart profit'!B42-1,0)","v":4376}]
[39,11,{"$f":"OFFSET('Wine production'!$H$4,'Chart profit'!B43-1,0)","v":4456}]
[40,4,{"$f":"OFFSET('Wine production'!$H$4,'Chart profit'!B44-1,0)","v":4560}]
[41,22,{"$f":"OFFSET('Wine production'!$H$4,'Chart profit'!B45-1,0)","v":4720}]
[42,92,{"$f":"OFFSET('Wine production'!$H$4,'Chart profit'!B46-1,0)","v":4736}]
[43,34,{"$f":"OFFSET('Wine production'!$H$4,'Chart profit'!B47-1,0)","v":4760}]
[44,99,{"$f":"OFFSET('Wine production'!$H$4,'Chart profit'!B48-1,0)","v":4832}]
[45,20,{"$f":"OFFSET('Wine production'!$H$4,'Chart profit'!B49-1,0)","v":4848}]
[46,93,{"$f":"OFFSET('Wine production'!$H$4,'Chart profit'!B50-1,0)","v":4872}]
[47,36,{"$f":"OFFSET('Wine production'!$H$4,'Chart profit'!B51-1,0)","v":5112}]
[48,14,{"$f":"OFFSET('Wine production'!$H$4,'Chart profit'!B52-1,0)","v":5192}]
[49,27,{"$f":"OFFSET('Wine production'!$H$4,'Chart profit'!B53-1,0)","v":5208}]
[50,8,{"$f":"OFFSET('Wine production'!$H$4,'Chart profit'!B54-1,0)","v":5352}]
[51,100,{"$f":"OFFSET('Wine production'!$H$4,'Chart profit'!B55-1,0)","v":5424}]
[52,72,{"$f":"OFFSET('Wine production'!$H$4,'Chart profit'!B56-1,0)","v":5600}]
[53,37,{"$f":"OFFSET('Wine production'!$H$4,'Chart profit'!B57-1,0)","v":5952}]
[54,75,{"$f":"OFFSET('Wine production'!$H$4,'Chart profit'!B58-1,0)","v":5992}]
[55,98,{"$f":"OFFSET('Wine production'!$H$4,'Chart profit'!B59-1,0)","v":6680}]
[56,70,{"$f":"OFFSET('Wine production'!$H$4,'Chart profit'!B60-1,0)","v":6800}]
[57,21,{"$f":"OFFSET('Wine production'!$H$4,'Chart profit'!B61-1,0)","v":6840}]
[58,45,{"$f":"OFFSET('Wine production'!$H$4,'Chart profit'!B62-1,0)","v":7080}]
[59,6,{"$f":"OFFSET('Wine production'!$H$4,'Chart profit'!B63-1,0)","v":7112}]
[60,67,{"$f":"OFFSET('Wine production'!$H$4,'Chart profit'!B64-1,0)","v":7600}]
[61,94,{"$f":"OFFSET('Wine production'!$H$4,'Chart profit'!B65-1,0)","v":7912}]
[62,64,{"$f":"OFFSET('Wine production'!$H$4,'Chart profit'!B66-1,0)","v":7928}]
[63,43,{"$f":"OFFSET('Wine production'!$H$4,'Chart profit'!B67-1,0)","v":8160}]
[64,9,{"$f":"OFFSET('Wine production'!$H$4,'Chart profit'!B68-1,0)","v":8480}]
[65,86,{"$f":"OFFSET('Wine production'!$H$4,'Chart profit'!B69-1,0)","v":8480}]
[66,79,{"$f":"OFFSET('Wine production'!$H$4,'Chart profit'!B70-1,0)","v":8896}]
[67,82,{"$f":"OFFSET('Wine production'!$H$4,'Chart profit'!B71-1,0)","v":9120}]
[68,15,{"$f":"OFFSET('Wine production'!$H$4,'Chart profit'!B72-1,0)","v":9312}]
[69,42,{"$f":"OFFSET('Wine production'!$H$4,'Chart profit'!B73-1,0)","v":9344}]
[70,80,{"$f":"OFFSET('Wine production'!$H$4,'Chart profit'!B74-1,0)","v":9376}]
[71,49,{"$f":"OFFSET('Wine production'!$H$4,'Chart profit'!B75-1,0)","v":9424}]
[72,60,{"$f":"OFFSET('Wine production'!$H$4,'Chart profit'!B76-1,0)","v":9472}]
[73,5,{"$f":"OFFSET('Wine production'!$H$4,'Chart profit'!B77-1,0)","v":9512}]
[74,63,{"$f":"OFFSET('Wine production'!$H$4,'Chart profit'!B78-1,0)","v":9520}]
[75,46,{"$f":"OFFSET('Wine production'!$H$4,'Chart profit'!B79-1,0)","v":9904}]
[76,84,{"$f":"OFFSET('Wine production'!$H$4,'Chart profit'!B80-1,0)","v":10024}]
[77,81,{"$f":"OFFSET('Wine production'!$H$4,'Chart profit'!B81-1,0)","v":10144}]
[78,52,{"$f":"OFFSET('Wine production'!$H$4,'Chart profit'!B82-1,0)","v":10312}]
[79,85,{"$f":"OFFSET('Wine production'!$H$4,'Chart profit'!B83-1,0)","v":10384}]
[80,91,{"$f":"OFFSET('Wine production'!$H$4,'Chart profit'!B84-1,0)","v":10512}]
[81,47,{"$f":"OFFSET('Wine production'!$H$4,'Chart profit'!B85-1,0)","v":10632}]
[82,19,{"$f":"OFFSET('Wine production'!$H$4,'Chart profit'!B86-1,0)","v":11656}]
[83,29,{"$f":"OFFSET('Wine production'!$H$4,'Chart profit'!B87-1,0)","v":11760}]
[84,17,{"$f":"OFFSET('Wine production'!$H$4,'Chart profit'!B88-1,0)","v":11880}]
[85,39,{"$f":"OFFSET('Wine production'!$H$4,'Chart profit'!B89-1,0)","v":11984}]
[86,65,{"$f":"OFFSET('Wine production'!$H$4,'Chart profit'!B90-1,0)","v":12152}]
[87,38,{"$f":"OFFSET('Wine production'!$H$4,'Chart profit'!B91-1,0)","v":12288}]
[88,78,{"$f":"OFFSET('Wine production'!$H$4,'Chart profit'!B92-1,0)","v":12664}]
[89,73,{"$f":"OFFSET('Wine production'!$H$4,'Chart profit'!B93-1,0)","v":12680}]
[90,41,{"$f":"OFFSET('Wine production'!$H$4,'Chart profit'!B94-1,0)","v":13064}]
[91,33,{"$f":"OFFSET('Wine production'!$H$4,'Chart profit'!B95-1,0)","v":13536}]
[92,57,{"$f":"OFFSET('Wine production'!$H$4,'Chart profit'!B96-1,0)","v":13888}]
[93,51,{"$f":"OFFSET('Wine production'!$H$4,'Chart profit'!B97-1,0)","v":15056}]
[94,23,{"$f":"OFFSET('Wine production'!$H$4,'Chart profit'!B98-1,0)","v":15064}]
[95,1,{"$f":"OFFSET('Wine production'!$H$4,'Chart profit'!B99-1,0)","v":15160}]
[96,76,{"$f":"OFFSET('Wine production'!$H$4,'Chart profit'!B100-1,0)","v":15280}]
[97,55,{"$f":"OFFSET('Wine production'!$H$4,'Chart profit'!B101-1,0)","v":16648}]
[98,89,{"$f":"OFFSET('Wine production'!$H$4,'Chart profit'!B102-1,0)","v":19800}]
[99,50,{"$f":"OFFSET('Wine production'!$H$4,'Chart profit'!B103-1,0)","v":22072}]
[100,26,{"$f":"OFFSET('Wine production'!$H$4,'Chart profit'!B104-1,0)","v":23288}]

{"sheet":"Target price","index":4,"n_rows":107,"n_cols":16,"rows_kept":107,"cut":false,"hidden":false,"merged":[]}
[]
["Year"]
["Simulation","Total hours of sun","Grape production","Wine bottles produced","Production costs","Total costs","Total Revenue","Profit/(loss)",null,"Profit Statistics"]
[1,{"$f":"SUM(Rawdata!A1:CV1)*Parameters!$B$17","v":654.35607690800362},{"$f":"Var_a*EXP(Var_b*'Target price'!B4+Var_c)","v":3663256.9520459962},{"$f":"ROUNDDOWN(C4*(1-Spoilage)/Grapes_per_bottle,0)","v":4395},{"$f":"D4*Prodcosts_per_bottle","v":8790},{"$f":"E4+Vineyard_cost_base","v":28790},{"$f":"D4*Target_price_per_bottle","v":50389.621391386638},{"$f":"G4-F4","v":21599.621391386638}]
[{"$f":"A4+1","v":2},{"$f":"SUM(Rawdata!A2:CV2)*Parameters!$B$17","v":586.49142249597139},{"$f":"Var_a*EXP(Var_b*'Target price'!B5+Var_c)","v":2539287.4127031821},3047,6094,26094,34934.511121628006,{"$f":"G5-F5","v":8840.5111216280056},null,"Average expected profit",null,{"$f":"AVERAGE($H$4:$H$103)","v":11332.039753904386},null,"Theoretical expected profit"]
[{"$f":"A5+1","v":3},{"$f":"SUM(Rawdata!A3:CV3)*Parameters!$B$17","v":577.31097746970283},{"$f":"Var_a*EXP(Var_b*'Target price'!B6+Var_c)","v":2416473.1287788786},2899,5798,25798,33237.659252247977,7439.6592522479768,null,"Maximum profit",null,{"$f":"MAX($H$4:$H$103)","v":31216.280170373859},null,null,"Total hours of sun",{"$f":"Max_sunhours_base/2*100","v":600}]
[4,{"$f":"SUM(Rawdata!A4:CV4)*Parameters!$B$17","v":587.89325548471425},{"$f":"Var_a*EXP(Var_b*'Target price'!B7+Var_c)","v":2558582.4985413733},3070,6140,26140,35198.211074301929,9058.2110743019293,null,"Maximum loss",null,{"$f":"MIN($H$4:$H$103)","v":0},null,null,"Grape production",{"$f":"Var_a*EXP(Var_b*P6+Var_c)","v":2731442.3800475686}]
[5,{"$f":"SUM(Rawdata!A5:CV5)*Parameters!$B$17","v":621.91163918622851},{"$f":"Var_a*EXP(Var_b*'Target price'!B8+Var_c)","v":3074531.911034931},3689,7378,27378,42295.179365830561,14917.179365830561,null,"Probability of making a loss",null,{"$f":"COUNTIF($H$4:$H$103,\"<0\")/COUNT(H4:H103)","v":0},null,null,"Wine bottles produced",{"$f":"ROUNDDOWN(P7*(1-Spoilage)/Grapes_per_bottle,0)","v":3277}]
[6,{"$f":"SUM(Rawdata!A6:CV6)*Parameters!$B$17","v":606.22991691901029},{"$f":"Var_a*EXP(Var_b*'Target price'!B9+Var_c)","v":2824895.4791262592},3389,6778,26778,38855.614765735911,12077.614765735911,null,null,null,null,null,null,"Production costs",{"$f":"P8*Prodcosts_per_bottle","v":6554}]
[7,{"$f":"SUM(Rawdata!A7:CV7)*Parameters!$B$17","v":547.24244153794029},{"$f":"Var_a*EXP(Var_b*'Target price'!B10+Var_c)","v":2054307.8905823957},2465,4930,24930,28261.755797444384,3331.7557974443844,null,null,null,null,null,null,"Total costs",{"$f":"P9+Vineyard_cost_base","v":26554}]
[8,{"$f":"SUM(Rawdata!A8:CV8)*Parameters!$B$17","v":593.76552236667828},{"$f":"Var_a*EXP(Var_b*'Target price'!B11+Var_c)","v":2641015.8499482553},3169,6338,26338,36333.267392333168,9995.2673923331677,null,"Goal seek",null,null,null,null,"Total Revenue",{"$f":"P8*Target_price_per_bottle","v":37571.510648367243}]
[9,{"$f":"SUM(Rawdata!A9:CV9)*Parameters!$B$17","v":615.34096102083004},{"$f":"Var_a*EXP(Var_b*'Target price'!B12+Var_c)","v":2967355.0590371531},3560,7120,27120,40816.166587789863,13696.166587789863,null,null,null,null,null,null,"Profit/(loss)",{"$f":"P11-P10","v":11017.510648367243}]
[10,{"$f":"SUM(Rawdata!A10:CV10)*Parameters!$B$17","v":578.15889653618319},{"$f":"Var_a*EXP(Var_b*'Target price'!B13+Var_c)","v":2427562.9559022509},2913,5826,25826,33398.172266919064,7572.172266919064,null,"Target maximum loss ",null,0]
[11,{"$f":"SUM(Rawdata!A11:CV11)*Parameters!$B$17","v":587.10170993171721},{"$f":"Var_a*EXP(Var_b*'Target price'!B14+Var_c)","v":2547669.5711370935},3057,6114,26114,35049.163274964492,8935.1632749644923,null,"By changing",null,"Target_price_per_bottle"]
[12,{"$f":"SUM(Rawdata!A12:CV12)*Parameters!$B$17","v":533.49954018315225},{"$f":"Var_a*EXP(Var_b*'Target price'!B15+Var_c)","v":1907373.8169913993},2288,4576,24576,26232.412683388538,1656.4126833885384]
[13,{"$f":"SUM(Rawdata!A13:CV13)*Parameters!$B$17","v":559.34526605584961},{"$f":"Var_a*EXP(Var_b*'Target price'!B16+Var_c)","v":2193052.1529622264},2631,5262,25262,30164.98154283009,4902.9815428300899,null,"Check goal seek",null,{"$f":"IF(L7=0,\"GOALSEEK OK\",\"RERUN GOALSEEK\")","v":"GOALSEEK OK"}]
[14,{"$f":"SUM(Rawdata!A14:CV14)*Parameters!$B$17","v":592.59084259367182},{"$f":"Var_a*EXP(Var_b*'Target price'!B17+Var_c)","v":2624316.1925128861},3149,6298,26298,36103.963085660187,9805.9630856601871]
[15,{"$f":"SUM(Rawdata!A15:CV15)*Parameters!$B$17","v":620.65820881791319},{"$f":"Var_a*EXP(Var_b*'Target price'!B18+Var_c)","v":3053792.1360517642},3664,7328,27328,42008.548982489338,14680.548982489338]
[16,{"$f":"SUM(Rawdata!A16:CV16)*Parameters!$B$17","v":543.33053830726635},{"$f":"Var_a*EXP(Var_b*'Target price'!B19+Var_c)","v":2011367.2624040388},2413,4826,24826,27665.564600094644,2839.5646000946435]
[17,{"$f":"SUM(Rawdata!A17:CV17)*Parameters!$B$17","v":636.21289378486551},{"$f":"Var_a*EXP(Var_b*'Target price'!B20+Var_c)","v":3321376.9484336129},3985,7970,27970,45688.883104590619,17718.883104590619]
[18,{"$f":"SUM(Rawdata!A18:CV18)*Parameters!$B$17","v":578.73547163086164},{"$f":"Var_a*EXP(Var_b*'Target price'!B21+Var_c)","v":2435132.9650617596},2922,5844,25844,33501.359204921901,7657.3592049219005]
[19,{"$f":"SUM(Rawdata!A19:CV19)*Parameters!$B$17","v":634.89101682656246},{"$f":"Var_a*EXP(Var_b*'Target price'!B22+Var_c)","v":3297752.9255291573},3957,7914,27914,45367.857075248452,17453.857075248452]
[20,{"$f":"SUM(Rawdata!A20:CV20)*Parameters!$B$17","v":590.08094695532714},{"$f":"Var_a*EXP(Var_b*'Target price'!B23+Var_c)","v":2588987.6422179937},3106,6212,26212,35610.95882631329,9398.95882631329]
[21,{"$f":"SUM(Rawdata!A21:CV21)*Parameters!$B$17","v":604.36949837129043},{"$f":"Var_a*EXP(Var_b*'Target price'!B24+Var_c)","v":2796657.9226387604},3355,6710,26710,38465.79744439185,11755.79744439185]
[22,{"$f":"SUM(Rawdata!A22:CV22)*Parameters!$B$17","v":589.09422606655437},{"$f":"Var_a*EXP(Var_b*'Target price'!B25+Var_c)","v":2575229.4444098501},3090,6180,26180,35427.51538097491,9247.5153809749099]
[23,{"$f":"SUM(Rawdata!A23:CV23)*Parameters!$B$17","v":653.85043771655876},{"$f":"Var_a*EXP(Var_b*'Target price'!B26+Var_c)","v":3653268.2491570925},4383,8766,28766,50252.038807382851,21486.038807382851]
[24,{"$f":"SUM(Rawdata!A24:CV24)*Parameters!$B$17","v":585.37236572380925},{"$f":"Var_a*EXP(Var_b*'Target price'!B27+Var_c)","v":2523989.0060895206},3028,6056,26056,34716.672030288682,8660.6720302886824]
[25,{"$f":"SUM(Rawdata!A25:CV25)*Parameters!$B$17","v":566.51271929159213},{"$f":"Var_a*EXP(Var_b*'Target price'!B28+Var_c)","v":2279596.6015926315},2735,5470,25470,31357.363937529568,5887.3639375295679]
[26,{"$f":"SUM(Rawdata!A26:CV26)*Parameters!$B$17","v":692.83781901984253},{"$f":"Var_a*EXP(Var_b*'Target price'!B29+Var_c)","v":4509354.5894378154},5411,10822,30822,62038.280170373859,31216.280170373859]
[27,{"$f":"SUM(Rawdata!A27:CV27)*Parameters!$B$17","v":592.73461148945137},{"$f":"Var_a*EXP(Var_b*'Target price'!B30+Var_c)","v":2626354.3768071174},3151,6302,26302,36126.893516327487,9824.8935163274873]
[28,{"$f":"SUM(Rawdata!A28:CV28)*Parameters!$B$17","v":558.59556214142344},{"$f":"Var_a*EXP(Var_b*'Target price'!B31+Var_c)","v":2184191.7454740806},2621,5242,25242,30050.329389493603,4808.3293894936032]
[29,{"$f":"SUM(Rawdata!A29:CV29)*Parameters!$B$17","v":635.52568758503935},{"$f":"Var_a*EXP(Var_b*'Target price'!B32+Var_c)","v":3309074.4468241674},3970,7940,27940,45516.904874585882,17576.904874585882]
[30,{"$f":"SUM(Rawdata!A30:CV30)*Parameters!$B$17","v":579.80899860724014},{"$f":"Var_a*EXP(Var_b*'Target price'!B33+Var_c)","v":2449290.5384806027},2939,5878,25878,33696.267865593931,7818.2678655939308]
[31,{"$f":"SUM(Rawdata!A31:CV31)*Parameters!$B$17","v":559.49487735134892},{"$f":"Var_a*EXP(Var_b*'Target price'!B34+Var_c)","v":2194824.6378799733},2633,5266,25266,30187.911973497386,4921.9119734973865]
[32,{"$f":"SUM(Rawdata!A32:CV32)*Parameters!$B$17","v":585.43097079734434},{"$f":"Var_a*EXP(Var_b*'Target price'!B35+Var_c)","v":2524787.8927246779},3029,6058,26058,34728.137245622325,8670.1372456223253]
[33,{"$f":"SUM(Rawdata!A33:CV33)*Parameters!$B$17","v":645.59735998196766},{"$f":"Var_a*EXP(Var_b*'Target price'!B36+Var_c)","v":3494029.1617538198},{"$f":"ROUNDDOWN(C36*(1-Spoilage)/Grapes_per_bottle,0)","v":4192},{"$f":"D36*Prodcosts_per_bottle","v":8384},{"$f":"E36+Vineyard_cost_base","v":28384},{"$f":"D36*Target_price_per_bottle","v":48062.182678655925},19678.182678655925]
[34,{"$f":"SUM(Rawdata!A34:CV34)*Parameters!$B$17","v":589.40567333614149},{"$f":"Var_a*EXP(Var_b*'Target price'!B37+Var_c)","v":2579564.1486406918},3095,6190,26190,35484.841457643153,9294.8414576431533]
[35,{"$f":"SUM(Rawdata!A35:CV35)*Parameters!$B$17","v":585.51367670768468},{"$f":"Var_a*EXP(Var_b*'Target price'!B38+Var_c)","v":2525915.7449199008},3031,6062,26062,34751.067676289626,8689.0676762896255]
[36,{"$f":"SUM(Rawdata!A36:CV36)*Parameters!$B$17","v":592.00820412532244},{"$f":"Var_a*EXP(Var_b*'Target price'!B39+Var_c)","v":2616072.4189290856},3139,6278,26278,35989.3109323237,9711.3109323237004]
[37,{"$f":"SUM(Rawdata!A37:CV37)*Parameters!$B$17","v":598.12550140789938},{"$f":"Var_a*EXP(Var_b*'Target price'!B40+Var_c)","v":2703933.3835457279},3244,6488,26488,37193.158542356825,10705.158542356825]
[38,{"$f":"SUM(Rawdata!A38:CV38)*Parameters!$B$17","v":638.54352801957748},{"$f":"Var_a*EXP(Var_b*'Target price'!B41+Var_c)","v":3363442.0367459548},4036,8072,28072,46273.60908660671,18201.60908660671]
[39,{"$f":"SUM(Rawdata!A39:CV39)*Parameters!$B$17","v":636.81075186647263},{"$f":"Var_a*EXP(Var_b*'Target price'!B42+Var_c)","v":3332117.1211462151},3998,7996,27996,45837.930903928049,17841.930903928049]
[40,{"$f":"SUM(Rawdata!A40:CV40)*Parameters!$B$17","v":576.43872235254662},{"$f":"Var_a*EXP(Var_b*'Target price'!B43+Var_c)","v":2405117.8747234014},2886,5772,25772,33088.611452910547,7316.6114529105471]
[41,{"$f":"SUM(Rawdata!A41:CV41)*Parameters!$B$17","v":642.95787256906601},{"$f":"Var_a*EXP(Var_b*'Target price'!B44+Var_c)","v":3444581.187249139},4133,8266,28266,47385.734973970641,19119.734973970641]
[42,{"$f":"SUM(Rawdata!A42:CV42)*Parameters!$B$17","v":620.87236421151351},{"$f":"Var_a*EXP(Var_b*'Target price'!B45+Var_c)","v":3057325.7035429082},3668,7336,27336,42054.409843823938,14718.409843823938]
[43,{"$f":"SUM(Rawdata!A43:CV43)*Parameters!$B$17","v":613.24953632034556},{"$f":"Var_a*EXP(Var_b*'Target price'!B46+Var_c)","v":2934031.1898209495},3520,7040,27040,40357.557974443909,13317.557974443909]
[44,{"$f":"SUM(Rawdata!A44:CV44)*Parameters!$B$17","v":569.25773184965374},{"$f":"Var_a*EXP(Var_b*'Target price'!B47+Var_c)","v":2313638.8989248257},2776,5552,25552,31827.437766209172,6275.437766209172]
[45,{"$f":"SUM(Rawdata!A45:CV45)*Parameters!$B$17","v":606.00258920582121},{"$f":"Var_a*EXP(Var_b*'Target price'!B48+Var_c)","v":2821429.8507535248},3385,6770,26770,38809.753904401317,12039.753904401317]
[46,{"$f":"SUM(Rawdata!A46:CV46)*Parameters!$B$17","v":624.34836150566832},{"$f":"Var_a*EXP(Var_b*'Target price'!B49+Var_c)","v":3115254.8607335933},3738,7476,27476,42856.974917179352,15380.974917179352]
[47,{"$f":"SUM(Rawdata!A47:CV47)*Parameters!$B$17","v":628.80109519931511},{"$f":"Var_a*EXP(Var_b*'Target price'!B50+Var_c)","v":3191068.2268369738},3829,7658,27658,43900.309512541397,16242.309512541397]
[48,{"$f":"SUM(Rawdata!A48:CV48)*Parameters!$B$17","v":527.10118185749093},{"$f":"Var_a*EXP(Var_b*'Target price'!B51+Var_c)","v":1842597.3804689557},2211,4422,24422,25349.591102697577,927.5911026975773]
[49,{"$f":"SUM(Rawdata!A49:CV49)*Parameters!$B$17","v":621.36720493716086},{"$f":"Var_a*EXP(Var_b*'Target price'!B52+Var_c)","v":3065506.2304878514},3678,7356,27356,42169.061997160425,14813.061997160425]
[50,{"$f":"SUM(Rawdata!A50:CV50)*Parameters!$B$17","v":687.57331831837303},{"$f":"Var_a*EXP(Var_b*'Target price'!B53+Var_c)","v":4382966.3014097279},5259,10518,30518,60295.567439659237,29777.567439659237]
[51,{"$f":"SUM(Rawdata!A51:CV51)*Parameters!$B$17","v":653.78336421321478},{"$f":"Var_a*EXP(Var_b*'Target price'!B54+Var_c)","v":3651945.2862574151},4382,8764,28764,50240.573592049208,21476.573592049208]
[52,{"$f":"SUM(Rawdata!A52:CV52)*Parameters!$B$17","v":626.88214176499457},{"$f":"Var_a*EXP(Var_b*'Target price'!B55+Var_c)","v":3158172.0010782438},3789,7578,27578,43441.700899195443,15863.700899195443]
[53,{"$f":"SUM(Rawdata!A53:CV53)*Parameters!$B$17","v":563.95137032990749},{"$f":"Var_a*EXP(Var_b*'Target price'!B56+Var_c)","v":2248283.8993261741},2697,5394,25394,30921.685754850914,5527.6857548509142]
[54,{"$f":"SUM(Rawdata!A54:CV54)*Parameters!$B$17","v":567.7157526262763},{"$f":"Var_a*EXP(Var_b*'Target price'!B57+Var_c)","v":2294453.9345684596},2753,5506,25506,31563.737813535248,6057.7378135352483]
[55,{"$f":"SUM(Rawdata!A55:CV55)*Parameters!$B$17","v":662.00410096906148},{"$f":"Var_a*EXP(Var_b*'Target price'!B58+Var_c)","v":3817714.5538587985},4581,9162,29162,52522.15144344532,23360.15144344532]
[56,{"$f":"SUM(Rawdata!A56:CV56)*Parameters!$B$17","v":546.16586698265996},{"$f":"Var_a*EXP(Var_b*'Target price'!B59+Var_c)","v":2042399.8136782618},2450,4900,24900,28089.777567439651,3189.7775674396507]
[57,{"$f":"SUM(Rawdata!A57:CV57)*Parameters!$B$17","v":647.52968954875462},{"$f":"Var_a*EXP(Var_b*'Target price'!B60+Var_c)","v":3530678.7664538026},4236,8472,28472,48566.652153336472,20094.652153336472]
[58,{"$f":"SUM(Rawdata!A58:CV58)*Parameters!$B$17","v":551.48457013252175},{"$f":"Var_a*EXP(Var_b*'Target price'!B61+Var_c)","v":2101910.0789367706},2522,5044,25044,28915.273071462369,3871.2730714623685]
[59,{"$f":"SUM(Rawdata!A59:CV59)*Parameters!$B$17","v":573.6523829143041},{"$f":"Var_a*EXP(Var_b*'Target price'!B62+Var_c)","v":2369200.7968295636},2843,5686,25686,32595.607193563643,6909.6071935636428]
[60,{"$f":"SUM(Rawdata!A60:CV60)*Parameters!$B$17","v":621.67721442815457},{"$f":"Var_a*EXP(Var_b*'Target price'!B63+Var_c)","v":3070642.3428872922},3684,7368,27368,42237.853289162318,14869.853289162318]
[61,{"$f":"SUM(Rawdata!A61:CV61)*Parameters!$B$17","v":573.46109752568316},{"$f":"Var_a*EXP(Var_b*'Target price'!B64+Var_c)","v":2366754.8154506236},2840,5680,25680,32561.211547562696,6881.2115475626961]
[62,{"$f":"SUM(Rawdata!A62:CV62)*Parameters!$B$17","v":557.82056878624121},{"$f":"Var_a*EXP(Var_b*'Target price'!B65+Var_c)","v":2175070.0816234373},2610,5220,25220,29924.212020823466,4704.2120208234664]
[63,{"$f":"SUM(Rawdata!A63:CV63)*Parameters!$B$17","v":621.97906614648582},{"$f":"Var_a*EXP(Var_b*'Target price'!B66+Var_c)","v":3075651.5691007026},3690,7380,27380,42306.644581164212,14926.644581164212]
[64,{"$f":"SUM(Rawdata!A64:CV64)*Parameters!$B$17","v":611.69877834030558},{"$f":"Var_a*EXP(Var_b*'Target price'!B67+Var_c)","v":2909563.9280471089},3491,6982,26982,40025.066729768092,13043.066729768092]
[65,{"$f":"SUM(Rawdata!A65:CV65)*Parameters!$B$17","v":637.78686708618829},{"$f":"Var_a*EXP(Var_b*'Target price'!B68+Var_c)","v":3349727.1550868726},{"$f":"ROUNDDOWN(C68*(1-Spoilage)/Grapes_per_bottle,0)","v":4019},{"$f":"D68*Prodcosts_per_bottle","v":8038},{"$f":"E68+Vineyard_cost_base","v":28038},{"$f":"D68*Target_price_per_bottle","v":46078.70042593468},18040.70042593468]
[66,{"$f":"SUM(Rawdata!A66:CV66)*Parameters!$B$17","v":530.08076513156698},{"$f":"Var_a*EXP(Var_b*'Target price'!B69+Var_c)","v":1872484.1012563375},2246,4492,24492,25750.873639375288,{"$f":"G69-F69","v":1258.8736393752879}]
[{"$f":"A69+1","v":67},{"$f":"SUM(Rawdata!A67:CV67)*Parameters!$B$17","v":609.50477981460062},{"$f":"Var_a*EXP(Var_b*'Target price'!B70+Var_c)","v":2875295.9986755196},3450,6900,26900,39554.992901088488,12654.992901088488]
[68,{"$f":"SUM(Rawdata!A68:CV68)*Parameters!$B$17","v":518.73228255394463},{"$f":"Var_a*EXP(Var_b*'Target price'!B71+Var_c)","v":1761180.1776360327},2113,4226,24226,24225.999999999993,0]
[69,{"$f":"SUM(Rawdata!A69:CV69)*Parameters!$B$17","v":532.91179632583112},{"$f":"Var_a*EXP(Var_b*'Target price'!B72+Var_c)","v":1901329.7583119369},2281,4562,24562,26152.156176052998,1590.1561760529985]
[70,{"$f":"SUM(Rawdata!A70:CV70)*Parameters!$B$17","v":604.05590637531736},{"$f":"Var_a*EXP(Var_b*'Target price'!B73+Var_c)","v":2791926.0786980744},3350,6700,26700,38408.471367723607,11708.471367723607]
[71,{"$f":"SUM(Rawdata!A71:CV71)*Parameters!$B$17","v":566.67722537410145},{"$f":"Var_a*EXP(Var_b*'Target price'!B74+Var_c)","v":2281622.5418498409},2737,5474,25474,31380.294368196868,5906.2943681968682]
[72,{"$f":"SUM(Rawdata!A72:CV72)*Parameters!$B$17","v":595.58504036723843},{"$f":"Var_a*EXP(Var_b*'Target price'!B75+Var_c)","v":2667092.7779962984},3200,6400,26400,36688.689067676278,10288.689067676278]
[73,{"$f":"SUM(Rawdata!A73:CV73)*Parameters!$B$17","v":640.78341131910884},{"$f":"Var_a*EXP(Var_b*'Target price'!B76+Var_c)","v":3404371.1393704512},4085,8170,28170,46835.4046379555,18665.4046379555]
[74,{"$f":"SUM(Rawdata!A74:CV74)*Parameters!$B$17","v":534.27061381943292},{"$f":"Var_a*EXP(Var_b*'Target price'!B77+Var_c)","v":1915332.2928246811},2298,4596,24596,26347.064836725029,1751.0648367250287]
[75,{"$f":"SUM(Rawdata!A75:CV75)*Parameters!$B$17","v":598.38388332559157},{"$f":"Var_a*EXP(Var_b*'Target price'!B78+Var_c)","v":2707708.7131828638},3249,6498,26498,37250.484619025076,10752.484619025076]
[76,{"$f":"SUM(Rawdata!A76:CV76)*Parameters!$B$17","v":654.97842030665527},{"$f":"Var_a*EXP(Var_b*'Target price'!B79+Var_c)","v":3675588.6020675469},4410,8820,28820,50561.599621391375,21741.599621391375]
[77,{"$f":"SUM(Rawdata!A77:CV77)*Parameters!$B$17","v":543.53509162281011},{"$f":"Var_a*EXP(Var_b*'Target price'!B80+Var_c)","v":2013590.2218535021},2416,4832,24832,27699.96024609559,2867.9602460955903]
[78,{"$f":"SUM(Rawdata!A78:CV78)*Parameters!$B$17","v":640.7248111110797},{"$f":"Var_a*EXP(Var_b*'Target price'!B81+Var_c)","v":3403294.0267731296},4083,8166,28166,46812.4742072882,18646.4742072882]
[79,{"$f":"SUM(Rawdata!A79:CV79)*Parameters!$B$17","v":618.0139189010165},{"$f":"Var_a*EXP(Var_b*'Target price'!B82+Var_c)","v":3010496.3818478989},3612,7224,27224,41412.357785139597,14188.357785139597]
[80,{"$f":"SUM(Rawdata!A80:CV80)*Parameters!$B$17","v":621.05057991324747},{"$f":"Var_a*EXP(Var_b*'Target price'!B83+Var_c)","v":3060269.382368851},3672,7344,27344,42100.270705158531,14756.270705158531]
[81,{"$f":"SUM(Rawdata!A81:CV81)*Parameters!$B$17","v":625.84348852801361},{"$f":"Var_a*EXP(Var_b*'Target price'!B84+Var_c)","v":3140508.2568592075},3768,7536,27536,43200.931377188819,15664.931377188819]
[82,{"$f":"SUM(Rawdata!A82:CV82)*Parameters!$B$17","v":619.43083977526487},{"$f":"Var_a*EXP(Var_b*'Target price'!B85+Var_c)","v":3033619.1594280074},3640,7280,27280,41733.383814481764,14453.383814481764]
[83,{"$f":"SUM(Rawdata!A83:CV83)*Parameters!$B$17","v":541.59610282798155},{"$f":"Var_a*EXP(Var_b*'Target price'!B86+Var_c)","v":1992616.8388450891},2391,4782,24782,27413.32986275437,2631.32986275437]
[84,{"$f":"SUM(Rawdata!A84:CV84)*Parameters!$B$17","v":625.08469547056484},{"$f":"Var_a*EXP(Var_b*'Target price'!B87+Var_c)","v":3127666.4067987269},3753,7506,27506,43028.953147184089,15522.953147184089]
[85,{"$f":"SUM(Rawdata!A85:CV85)*Parameters!$B$17","v":627.28696690907236},{"$f":"Var_a*EXP(Var_b*'Target price'!B88+Var_c)","v":3165083.4929301227},3798,7596,27596,43544.887837198286,15948.887837198286]
[86,{"$f":"SUM(Rawdata!A86:CV86)*Parameters!$B$17","v":615.30402531880873},{"$f":"Var_a*EXP(Var_b*'Target price'!B89+Var_c)","v":2966763.2708078604},3560,7120,27120,40816.166587789863,13696.166587789863]
[87,{"$f":"SUM(Rawdata!A87:CV87)*Parameters!$B$17","v":558.83578949782179},{"$f":"Var_a*EXP(Var_b*'Target price'!B90+Var_c)","v":2187026.9781356589},2624,5248,25248,30084.72503549455,4836.72503549455]
[88,{"$f":"SUM(Rawdata!A88:CV88)*Parameters!$B$17","v":582.78172357521169},{"$f":"Var_a*EXP(Var_b*'Target price'!B91+Var_c)","v":2488925.574866971},2986,5972,25972,34235.132986275428,8263.1329862754283]
[89,{"$f":"SUM(Rawdata!A89:CV89)*Parameters!$B$17","v":677.28996544346819},{"$f":"Var_a*EXP(Var_b*'Target price'!B92+Var_c)","v":4146213.9946500319},4975,9950,29950,57039.446284902966,27089.446284902966]
[90,{"$f":"SUM(Rawdata!A90:CV90)*Parameters!$B$17","v":569.45932021728481},{"$f":"Var_a*EXP(Var_b*'Target price'!B93+Var_c)","v":2316158.8447739384},2779,5558,25558,31861.833412210119,6303.8334122101187]
[91,{"$f":"SUM(Rawdata!A91:CV91)*Parameters!$B$17","v":628.09196750172111},{"$f":"Var_a*EXP(Var_b*'Target price'!B94+Var_c)","v":3178872.0687818886},3814,7628,27628,43728.331282536667,16100.331282536667]
[92,{"$f":"SUM(Rawdata!A92:CV92)*Parameters!$B$17","v":589.23210191257556},{"$f":"Var_a*EXP(Var_b*'Target price'!B95+Var_c)","v":2577147.4928101939},3092,6184,26184,35450.445811642203,9266.4458116422029]
[93,{"$f":"SUM(Rawdata!A93:CV93)*Parameters!$B$17","v":590.25267512515347},{"$f":"Var_a*EXP(Var_b*'Target price'!B96+Var_c)","v":2591389.60714678},3109,6218,26218,35645.354472314233,9427.3544723142331]
[94,{"$f":"SUM(Rawdata!A94:CV94)*Parameters!$B$17","v":611.61535218300412},{"$f":"Var_a*EXP(Var_b*'Target price'!B97+Var_c)","v":2908253.4610679033},3489,6978,26978,40002.136299100792,13024.136299100792]
[95,{"$f":"SUM(Rawdata!A95:CV95)*Parameters!$B$17","v":573.87423252686358},{"$f":"Var_a*EXP(Var_b*'Target price'!B98+Var_c)","v":2372040.7715233807},2846,5692,25692,32630.00283956459,6938.0028395645895]
[96,{"$f":"SUM(Rawdata!A96:CV96)*Parameters!$B$17","v":568.29899521838172},{"$f":"Var_a*EXP(Var_b*'Target price'!B99+Var_c)","v":2301691.7319485992},2762,5524,25524,31666.924751538088,6142.9247515380885]
[97,{"$f":"SUM(Rawdata!A97:CV97)*Parameters!$B$17","v":534.42533056468687},{"$f":"Var_a*EXP(Var_b*'Target price'!B100+Var_c)","v":1916933.1649557194},{"$f":"ROUNDDOWN(C100*(1-Spoilage)/Grapes_per_bottle,0)","v":2300},{"$f":"D100*Prodcosts_per_bottle","v":4600},{"$f":"E100+Vineyard_cost_base","v":24600},26369.995267392325,1769.9952673923253]
[98,{"$f":"SUM(Rawdata!A98:CV98)*Parameters!$B$17","v":603.24418163904045},{"$f":"Var_a*EXP(Var_b*'Target price'!B101+Var_c)","v":2779714.9733178513},{"$f":"ROUNDDOWN(C101*(1-Spoilage)/Grapes_per_bottle,0)","v":3335},{"$f":"D101*Prodcosts_per_bottle","v":6670},{"$f":"E101+Vineyard_cost_base","v":26670},38236.49313771887,11566.49313771887]
[99,{"$f":"SUM(Rawdata!A99:CV99)*Parameters!$B$17","v":589.93760672633732},{"$f":"Var_a*EXP(Var_b*'Target price'!B102+Var_c)","v":2586984.4447526941},{"$f":"ROUNDDOWN(C102*(1-Spoilage)/Grapes_per_bottle,0)","v":3104},{"$f":"D102*Prodcosts_per_bottle","v":6208},{"$f":"E102+Vineyard_cost_base","v":26208},35588.02839564599,9380.0283956459898]
[100,{"$f":"SUM(Rawdata!A100:CV100)*Parameters!$B$17","v":594.27908571648027},{"$f":"Var_a*EXP(Var_b*'Target price'!B103+Var_c)","v":2648350.1915126042},{"$f":"ROUNDDOWN(C103*(1-Spoilage)/Grapes_per_bottle,0)","v":3178},{"$f":"D103*Prodcosts_per_bottle","v":6356},{"$f":"E103+Vineyard_cost_base","v":26356},36436.454330336004,10080.454330336004]
[]
["Total",{"$f":"SUM(B4:B103)","v":59805.795797680017}]
["Expected",{"$f":"Rawdata!CY6*Rawdata!CY2*Max_sunhours_base","v":59805.795797680206}]
["Check",{"$f":"IF(TRUNC(B105)=TRUNC(B106),\"OK\",\"CHECK\")","v":"OK"}]

{"sheet":"Wine production Alt","index":5,"n_rows":107,"n_cols":28,"rows_kept":107,"cut":false,"hidden":false,"merged":[[1,2,1,11],[9,21,10,23],[13,27,17,29]]}
[null,null,{"$f":"SUMIF(C4:L4,\">\"&Overtime_limit_alt,C4:L4)-COUNTIF(C4:L4,\">\"&Overtime_limit_alt)*Overtime_limit_alt","v":31.176035813462704}]
["Year",null,"Daily hours of sunshine over harvesting period"]
["Simulation","Total hours of sun","Day 1","Day 2","Day 3","Day 4","Day 5","Day 6","Day 7","Day 8","Day 9","Day 10","Grape production","Wine bottles produced","Production costs","Overtime costs","Total costs","Total Revenue","Profit/(loss)","Rank",null,"Profit Statistics"]
[1,{"$f":"SUM(Rawdata!A1:CL1)*Max_sunhours_alt","v":722.64628474589688},{"$f":"Rawdata!CM1*Max_sunhours_alt","v":3.5085154602028097},{"$f":"Rawdata!CN1*Max_sunhours_alt","v":14.511279438621033},{"$f":"Rawdata!CO1*Max_sunhours_alt","v":4.7942265404848809},{"$f":"Rawdata!CP1*Max_sunhours_alt","v":12.362447906444302},{"$f":"Rawdata!CQ1*Max_sunhours_alt","v":9.0761179784226496},{"$f":"Rawdata!CR1*Max_sunhours_alt","v":13.927988887368784},{"$f":"Rawdata!CS1*Max_sunhours_alt","v":3.3200335749574714},{"$f":"Rawdata!CT1*Max_sunhours_alt","v":14.639710617863631},{"$f":"Rawdata!CU1*Max_sunhours_alt","v":9.9937596343456594},{"$f":"Rawdata!CV1*Max_sunhours_alt","v":9.1647313503966359},{"$f":"Var_a*EXP(Var_b*'Wine production Alt'!B4+Var_c)","v":5296889.4478764562},{"$f":"ROUNDDOWN(M4*(1-Spoilage)/Grapes_per_bottle,0)","v":6356},{"$f":"N4*Prodcosts_per_bottle","v":12712},{"$f":"(SUMIF(C4:L4,\">\"&Overtime_limit_alt,C4:L4)-COUNTIF(C4:L4,\">\"&Overtime_limit_alt)*Overtime_limit_alt)\n*Number_worker_alt*Overtime_hourly_rate_alt","v":3117.6035813462704},{"$f":"O4+P4+Vineyard_cost_alt","v":40829.603581346266},{"$f":"N4*Price_per_bottle","v":63560},{"$f":"R4-Q4","v":22730.396418653734},{"$f":"RANK(S4,$S$4:$S$103,1)","v":84}]
[{"$f":"A4+1","v":2},{"$f":"SUM(Rawdata!A2:CL2)*Max_sunhours_alt","v":657.62005252952372},{"$f":"Rawdata!CM2*Max_sunhours_alt","v":9.1927169146890026},{"$f":"Rawdata!CN2*Max_sunhours_alt","v":13.838359270987793},{"$f":"Rawdata!CO2*Max_sunhours_alt","v":6.3030618280715611},{"$f":"Rawdata!CP2*Max_sunhours_alt","v":1.4661609423361148},{"$f":"Rawdata!CQ2*Max_sunhours_alt","v":9.9904125362445093},{"$f":"Rawdata!CR2*Max_sunhours_alt","v":14.33020586518623},{"$f":"Rawdata!CS2*Max_sunhours_alt","v":1.6189266192739509},{"$f":"Rawdata!CT2*Max_sunhours_alt","v":3.7333244330565818},{"$f":"Rawdata!CU2*Max_sunhours_alt","v":11.586239359161263},{"$f":"Rawdata!CV2*Max_sunhours_alt","v":3.4348178214334659},{"$f":"Var_a*EXP(Var_b*'Wine production Alt'!B5+Var_c)","v":3728395.9377854094},4474,8948,{"$f":"(SUMIF(C5:L5,\">\"&Overtime_limit_alt,C5:L5)-COUNTIF(C5:L5,\">\"&Overtime_limit_alt)*Overtime_limit_alt)\n*Number_worker_alt*Overtime_hourly_rate_alt","v":2143.7933946268795},36091.793394626875,44740,{"$f":"R5-Q5","v":8648.2066053731251},{"$f":"RANK(S5,$S$4:$S$103,1)","v":39},null,"Average expected profit",null,{"$f":"AVERAGE($S$4:$S$103)","v":13133.016969142724},null,"Theoretical expected profit"]
[{"$f":"A5+1","v":3},{"$f":"SUM(Rawdata!A3:CL3)*Max_sunhours_alt","v":635.22191372025668},{"$f":"Rawdata!CM3*Max_sunhours_alt","v":14.200287761534353},{"$f":"Rawdata!CN3*Max_sunhours_alt","v":7.9064367199401415},{"$f":"Rawdata!CO3*Max_sunhours_alt","v":10.135452836134325},{"$f":"Rawdata!CP3*Max_sunhours_alt","v":9.6471584159573922},{"$f":"Rawdata!CQ3*Max_sunhours_alt","v":6.2617224171399268},{"$f":"Rawdata!CR3*Max_sunhours_alt","v":9.8751015041697485},{"$f":"Rawdata!CS3*Max_sunhours_alt","v":0.97372004674408374},{"$f":"Rawdata!CT3*Max_sunhours_alt","v":7.1539831003644903},{"$f":"Rawdata!CU3*Max_sunhours_alt","v":14.643270817112105},{"$f":"Rawdata!CV3*Max_sunhours_alt","v":5.6196744977753337},{"$f":"Var_a*EXP(Var_b*'Wine production Alt'!B6+Var_c)","v":3303650.760689172},3964,7928,2140.7708054848072,35068.770805484804,39640,4571.2291945151956,23,null,"Maximum profit",null,{"$f":"MAX($S$4:$S$103)","v":40640.869290191215},null,null,"Total hours of sun",{"$f":"Max_sunhours_alt/2*Growing_days_alt","v":675}]
[4,{"$f":"SUM(Rawdata!A4:CL4)*Max_sunhours_alt","v":663.42702256492043},{"$f":"Rawdata!CM4*Max_sunhours_alt","v":8.1054495917741427},{"$f":"Rawdata!CN4*Max_sunhours_alt","v":1.8297301498760139},{"$f":"Rawdata!CO4*Max_sunhours_alt","v":4.069161397859256},{"$f":"Rawdata!CP4*Max_sunhours_alt","v":10.009634511604784},{"$f":"Rawdata!CQ4*Max_sunhours_alt","v":11.689427145441208},{"$f":"Rawdata!CR4*Max_sunhours_alt","v":5.4414106684052719},{"$f":"Rawdata!CS4*Max_sunhours_alt","v":14.050972820656526},{"$f":"Rawdata!CT4*Max_sunhours_alt","v":1.6635675754259234},{"$f":"Rawdata!CU4*Max_sunhours_alt","v":1.2346751675412659},{"$f":"Rawdata!CV4*Max_sunhours_alt","v":13.34551776238802},{"$f":"Var_a*EXP(Var_b*'Wine production Alt'!B7+Var_c)","v":3847162.0086303959},4616,9232,1970.1001831864683,36202.100183186471,46160,9957.8998168135295,41,null,"Maximum loss",null,{"$f":"MIN($S$4:$S$103)","v":-4632.1867683187593},null,null,"Grape production",{"$f":"Var_a*EXP(Var_b*AB6+Var_c)","v":4095258.3891663263}]
[5,{"$f":"SUM(Rawdata!A5:CL5)*Max_sunhours_alt","v":684.03112990660406},{"$f":"Rawdata!CM5*Max_sunhours_alt","v":9.338465658823857},{"$f":"Rawdata!CN5*Max_sunhours_alt","v":5.6570200963506583},{"$f":"Rawdata!CO5*Max_sunhours_alt","v":11.436787037420512},{"$f":"Rawdata!CP5*Max_sunhours_alt","v":4.0894664228739428},{"$f":"Rawdata!CQ5*Max_sunhours_alt","v":12.824049251946583},{"$f":"Rawdata!CR5*Max_sunhours_alt","v":7.8077995956424173},{"$f":"Rawdata!CS5*Max_sunhours_alt","v":14.932531195487174},{"$f":"Rawdata!CT5*Max_sunhours_alt","v":2.2298930944120836},{"$f":"Rawdata!CU5*Max_sunhours_alt","v":13.459837663337114},{"$f":"Rawdata!CV5*Max_sunhours_alt","v":11.582569059887341},{"$f":"Var_a*EXP(Var_b*'Wine production Alt'!B8+Var_c)","v":4299926.4397038398},5159,10318,2888.2039462545008,38206.2039462545,51590,13383.7960537455,53,null,"Probability of making a loss",null,{"$f":"COUNTIF($S$4:$S$103,\"<0\")/COUNT(S4:S103)","v":7.0000000000000007E-2},null,null,"Wine bottles produced",{"$f":"ROUNDDOWN(AB7*(1-Spoilage)/Grapes_per_bottle,0)","v":4914}]
[6,{"$f":"SUM(Rawdata!A6:CL6)*Max_sunhours_alt","v":704.04011207012479},{"$f":"Rawdata!CM6*Max_sunhours_alt","v":3.7060773586365565},{"$f":"Rawdata!CN6*Max_sunhours_alt","v":1.9103974708996811},{"$f":"Rawdata!CO6*Max_sunhours_alt","v":4.8938199151884456},{"$f":"Rawdata!CP6*Max_sunhours_alt","v":0.88842115197790894},{"$f":"Rawdata!CQ6*Max_sunhours_alt","v":2.278010083439634},{"$f":"Rawdata!CR6*Max_sunhours_alt","v":0.98987000273292158},{"$f":"Rawdata!CS6*Max_sunhours_alt","v":5.7174592501911174},{"$f":"Rawdata!CT6*Max_sunhours_alt","v":12.981479342826367},{"$f":"Rawdata!CU6*Max_sunhours_alt","v":12.056531246485987},{"$f":"Rawdata!CV6*Max_sunhours_alt","v":8.3252182562594719},{"$f":"Var_a*EXP(Var_b*'Wine production Alt'!B9+Var_c)","v":4790555.7094402472},5748,11496,1086.3228845571825,37582.322884557187,57480,19897.677115442813,77,null,null,null,null,null,null,"Production costs",{"$f":"AB8*Prodcosts_per_bottle","v":9828}]
[7,{"$f":"SUM(Rawdata!A7:CL7)*Max_sunhours_alt","v":627.64172906339718},{"$f":"Rawdata!CM7*Max_sunhours_alt","v":2.9094549917951613},{"$f":"Rawdata!CN7*Max_sunhours_alt","v":9.8043661280138861E-2},{"$f":"Rawdata!CO7*Max_sunhours_alt","v":2.4499942445587894},{"$f":"Rawdata!CP7*Max_sunhours_alt","v":6.5401838002408015},{"$f":"Rawdata!CQ7*Max_sunhours_alt","v":6.5695761548207585},{"$f":"Rawdata!CR7*Max_sunhours_alt","v":10.313033098025871},{"$f":"Rawdata!CS7*Max_sunhours_alt","v":3.0183367285316538},{"$f":"Rawdata!CT7*Max_sunhours_alt","v":6.66122244564884},{"$f":"Rawdata!CU7*Max_sunhours_alt","v":3.1058746587607549},{"$f":"Rawdata!CV7*Max_sunhours_alt","v":14.745603075365368},{"$f":"Var_a*EXP(Var_b*'Wine production Alt'!B10+Var_c)","v":3171152.7044439386},3805,7610,1005.8636173391238,33615.863617339128,38050,4434.1363826608722,22,null,"Components of Expected Profit of Median (50th Ranked) Simulation",null,null,null,null,"Overtime costs",{"$f":"(Max_sunhours_alt/2-Overtime_limit_alt)*Number_worker_alt*Overtime_hourly_rate","v":0}]
[8,{"$f":"SUM(Rawdata!A8:CL8)*Max_sunhours_alt","v":661.4214274864604},{"$f":"Rawdata!CM8*Max_sunhours_alt","v":7.2236854528061976},{"$f":"Rawdata!CN8*Max_sunhours_alt","v":2.9587127481088453},{"$f":"Rawdata!CO8*Max_sunhours_alt","v":12.657045480286349},{"$f":"Rawdata!CP8*Max_sunhours_alt","v":4.7356882548975623},{"$f":"Rawdata!CQ8*Max_sunhours_alt","v":10.715371679476441},{"$f":"Rawdata!CR8*Max_sunhours_alt","v":4.7521857544876482},{"$f":"Rawdata!CS8*Max_sunhours_alt","v":13.588222473452962},{"$f":"Rawdata!CT8*Max_sunhours_alt","v":0.60842713589456698},{"$f":"Rawdata!CU8*Max_sunhours_alt","v":12.67999220518433},{"$f":"Rawdata!CV8*Max_sunhours_alt","v":10.86614428729254},{"$f":"Var_a*EXP(Var_b*'Wine production Alt'!B11+Var_c)","v":3805721.2342771953},4566,9132,2300.6776125692622,36432.677612569263,45660,9227.3223874307369,40,null,null,null,null,null,null,"Total costs",{"$f":"AB9+Vineyard_cost_alt","v":34828}]
[9,{"$f":"SUM(Rawdata!A9:CL9)*Max_sunhours_alt","v":700.6554258658706},{"$f":"Rawdata!CM9*Max_sunhours_alt","v":3.2609579349392059},{"$f":"Rawdata!CN9*Max_sunhours_alt","v":2.1789905407215708},{"$f":"Rawdata!CO9*Max_sunhours_alt","v":3.1867531744336715},{"$f":"Rawdata!CP9*Max_sunhours_alt","v":8.6895413535398465},{"$f":"Rawdata!CQ9*Max_sunhours_alt","v":12.657191685662124},{"$f":"Rawdata!CR9*Max_sunhours_alt","v":13.738950992932848},{"$f":"Rawdata!CS9*Max_sunhours_alt","v":2.1957329534370187},{"$f":"Rawdata!CT9*Max_sunhours_alt","v":10.442641007467785},{"$f":"Rawdata!CU9*Max_sunhours_alt","v":3.7342176722995468},{"$f":"Rawdata!CV9*Max_sunhours_alt","v":8.4357980947332436},{"$f":"Var_a*EXP(Var_b*'Wine production Alt'!B12+Var_c)","v":4703792.5727148857},5644,11288,1646.412313433585,37934.412313433582,56440,18505.587686566418,72,null,null,null,null,null,null,"Total Revenue",{"$f":"AB8*Price_per_bottle","v":49140}]
[10,{"$f":"SUM(Rawdata!A10:CL10)*Max_sunhours_alt","v":649.66003675942704},{"$f":"Rawdata!CM10*Max_sunhours_alt","v":4.8312879568421465},{"$f":"Rawdata!CN10*Max_sunhours_alt","v":12.162842937028437},{"$f":"Rawdata!CO10*Max_sunhours_alt","v":1.0174677813878397},{"$f":"Rawdata!CP10*Max_sunhours_alt","v":6.7910597946352951},{"$f":"Rawdata!CQ10*Max_sunhours_alt","v":4.9681476955216501},{"$f":"Rawdata!CR10*Max_sunhours_alt","v":9.5854094380429657},{"$f":"Rawdata!CS10*Max_sunhours_alt","v":13.032479755574801},{"$f":"Rawdata!CT10*Max_sunhours_alt","v":5.7104220732480639},{"$f":"Rawdata!CU10*Max_sunhours_alt","v":13.630611223120784},{"$f":"Rawdata!CV10*Max_sunhours_alt","v":1.3088552553998549},{"$f":"Var_a*EXP(Var_b*'Wine production Alt'!B13+Var_c)","v":3571529.7753621987},4285,8570,1841.1343353766981,35411.134335376701,42850,7438.8656646232994,34,null,"Simulation to find",null,50,null,null,"Profit/(loss)",{"$f":"AB12-AB11","v":14312}]
[11,{"$f":"SUM(Rawdata!A11:CL11)*Max_sunhours_alt","v":674.37722472782775},{"$f":"Rawdata!CM11*Max_sunhours_alt","v":9.5997298774061726},{"$f":"Rawdata!CN11*Max_sunhours_alt","v":0.57930026229652931},{"$f":"Rawdata!CO11*Max_sunhours_alt","v":5.3072907234334368},{"$f":"Rawdata!CP11*Max_sunhours_alt","v":7.9274575914965002},{"$f":"Rawdata!CQ11*Max_sunhours_alt","v":1.0172230674748777},{"$f":"Rawdata!CR11*Max_sunhours_alt","v":1.8519647317292138},{"$f":"Rawdata!CS11*Max_sunhours_alt","v":2.6250001144710384},{"$f":"Rawdata!CT11*Max_sunhours_alt","v":6.7067063879933446},{"$f":"Rawdata!CU11*Max_sunhours_alt","v":10.692155047264261},{"$f":"Rawdata!CV11*Max_sunhours_alt","v":13.193084883253293},{"$f":"Var_a*EXP(Var_b*'Wine production Alt'!B14+Var_c)","v":4081509.2227021237},4897,9794,1141.242739942023,35935.242739942027,48970,13034.757260057973,51,null,null,null,null,null,null,null,"Note: some overtime costs would be expected as these are floored at zero - therefore this estimate is expected to over state the expected profit, which it does."]
[12,{"$f":"SUM(Rawdata!A12:CL12)*Max_sunhours_alt","v":595.3506408953225},{"$f":"Rawdata!CM12*Max_sunhours_alt","v":10.011129430949376},{"$f":"Rawdata!CN12*Max_sunhours_alt","v":6.7074692562509108},{"$f":"Rawdata!CO12*Max_sunhours_alt","v":2.8116462742150206},{"$f":"Rawdata!CP12*Max_sunhours_alt","v":11.084386499908119},{"$f":"Rawdata!CQ12*Max_sunhours_alt","v":5.9108520024068483},{"$f":"Rawdata!CR12*Max_sunhours_alt","v":3.683747232786021},{"$f":"Rawdata!CS12*Max_sunhours_alt","v":11.678666514768702},{"$f":"Rawdata!CT12*Max_sunhours_alt","v":1.3669243911998319},{"$f":"Rawdata!CU12*Max_sunhours_alt","v":4.7507468235962511},{"$f":"Rawdata!CV12*Max_sunhours_alt","v":13.518215907536618},{"$f":"Var_a*EXP(Var_b*'Wine production Alt'!B15+Var_c)","v":2663719.0218756474},3196,6392,1629.239835316281,33021.239835316279,31960,-1061.2398353162789,5,null,"Simulation",null,{"$f":"MATCH(X13,T4:T103,0)","v":45}]
[13,{"$f":"SUM(Rawdata!A13:CL13)*Max_sunhours_alt","v":640.81953688906776},{"$f":"Rawdata!CM13*Max_sunhours_alt","v":13.473723651094756},{"$f":"Rawdata!CN13*Max_sunhours_alt","v":6.3368600552497432},{"$f":"Rawdata!CO13*Max_sunhours_alt","v":10.356413074996624},{"$f":"Rawdata!CP13*Max_sunhours_alt","v":12.068713052509477},{"$f":"Rawdata!CQ13*Max_sunhours_alt","v":1.1822832687441092},{"$f":"Rawdata!CR13*Max_sunhours_alt","v":3.6027743680546571},{"$f":"Rawdata!CS13*Max_sunhours_alt","v":0.32297141565029719},{"$f":"Rawdata!CT13*Max_sunhours_alt","v":2.365127160452682},{"$f":"Rawdata!CU13*Max_sunhours_alt","v":5.3400950862881942},{"$f":"Rawdata!CV13*Max_sunhours_alt","v":3.3130845477035979},{"$f":"Var_a*EXP(Var_b*'Wine production Alt'!B16+Var_c)","v":3405035.3223300255},4086,8172,1339.8849778600861,34511.884977860085,40860,6348.1150221399148,29]
[14,{"$f":"SUM(Rawdata!A14:CL14)*Max_sunhours_alt","v":666.1065119984321},{"$f":"Rawdata!CM14*Max_sunhours_alt","v":5.7910461630240784},{"$f":"Rawdata!CN14*Max_sunhours_alt","v":4.160482361815883},{"$f":"Rawdata!CO14*Max_sunhours_alt","v":5.0001420812309814},{"$f":"Rawdata!CP14*Max_sunhours_alt","v":9.9868503513015501},{"$f":"Rawdata!CQ14*Max_sunhours_alt","v":10.034938212470902},{"$f":"Rawdata!CR14*Max_sunhours_alt","v":1.4839853321032492},{"$f":"Rawdata!CS14*Max_sunhours_alt","v":1.3514767966858776},{"$f":"Rawdata!CT14*Max_sunhours_alt","v":14.324217382843818},{"$f":"Rawdata!CU14*Max_sunhours_alt","v":10.336196664906311},{"$f":"Rawdata!CV14*Max_sunhours_alt","v":12.162705897275078},{"$f":"Var_a*EXP(Var_b*'Wine production Alt'!B17+Var_c)","v":3903232.1987379263},4683,9366,1934.4908508797657,36300.490850879767,46830,10529.509149120233,43,null,"Variable costs",null,{"$f":"VLOOKUP(X15,$A$4:$S$103,15,FALSE)+VLOOKUP(X15,$A$4:$S$103,16,FALSE)","v":11949.953017925542}]
[15,{"$f":"SUM(Rawdata!A15:CL15)*Max_sunhours_alt","v":733.01416727320748},{"$f":"Rawdata!CM15*Max_sunhours_alt","v":4.2025843667721183},{"$f":"Rawdata!CN15*Max_sunhours_alt","v":0.46942847572523205},{"$f":"Rawdata!CO15*Max_sunhours_alt","v":1.1670051896079632},{"$f":"Rawdata!CP15*Max_sunhours_alt","v":1.1410526154839356},{"$f":"Rawdata!CQ15*Max_sunhours_alt","v":12.311035116040573},{"$f":"Rawdata!CR15*Max_sunhours_alt","v":5.174793959784652},{"$f":"Rawdata!CS15*Max_sunhours_alt","v":1.3867925770755241E-2},{"$f":"Rawdata!CT15*Max_sunhours_alt","v":13.202282827531468},{"$f":"Rawdata!CU15*Max_sunhours_alt","v":2.86693927440722},{"$f":"Rawdata!CV15*Max_sunhours_alt","v":2.2596039980601446},{"$f":"Var_a*EXP(Var_b*'Wine production Alt'!B18+Var_c)","v":5601902.7526411368},6722,13444,1051.331794357204,39495.331794357204,67220,27724.668205642796,92,null,"Fixed costs",null,{"$f":"Vineyard_cost_alt","v":25000}]
[16,{"$f":"SUM(Rawdata!A16:CL16)*Max_sunhours_alt","v":632.76126886240786},{"$f":"Rawdata!CM16*Max_sunhours_alt","v":0.12435674717568845},{"$f":"Rawdata!CN16*Max_sunhours_alt","v":3.5073579408095421},{"$f":"Rawdata!CO16*Max_sunhours_alt","v":5.0693330577830888},{"$f":"Rawdata!CP16*Max_sunhours_alt","v":3.2634685345825871},{"$f":"Rawdata!CQ16*Max_sunhours_alt","v":12.001962665595695},{"$f":"Rawdata!CR16*Max_sunhours_alt","v":13.912094708698906},{"$f":"Rawdata!CS16*Max_sunhours_alt","v":0.82776249080527553},{"$f":"Rawdata!CT16*Max_sunhours_alt","v":1.166608698979164},{"$f":"Rawdata!CU16*Max_sunhours_alt","v":6.5005080251892498},{"$f":"Rawdata!CV16*Max_sunhours_alt","v":2.8451152056125362E-2},{"$f":"Var_a*EXP(Var_b*'Wine production Alt'!B19+Var_c)","v":3260043.9140941356},3912,7824,1091.40573742946,33915.405737429464,39120,5204.5942625705356,27,null,"Total costs",null,{"$f":"VLOOKUP(X15,$A$4:$S$103,17,FALSE)","v":36949.953017925538}]
[17,{"$f":"SUM(Rawdata!A17:CL17)*Max_sunhours_alt","v":712.03318527925421},{"$f":"Rawdata!CM17*Max_sunhours_alt","v":2.4514969691038475},{"$f":"Rawdata!CN17*Max_sunhours_alt","v":13.449385927420005},{"$f":"Rawdata!CO17*Max_sunhours_alt","v":5.2990762812553331},{"$f":"Rawdata!CP17*Max_sunhours_alt","v":6.1479163070559322},{"$f":"Rawdata!CQ17*Max_sunhours_alt","v":13.148760829644273},{"$f":"Rawdata!CR17*Max_sunhours_alt","v":10.333215379141361},{"$f":"Rawdata!CS17*Max_sunhours_alt","v":3.9199157687751147},{"$f":"Rawdata!CT17*Max_sunhours_alt","v":13.422211782222716},{"$f":"Rawdata!CU17*Max_sunhours_alt","v":13.643410143719073},{"$f":"Rawdata!CV17*Max_sunhours_alt","v":1.4175425634901095},{"$f":"Var_a*EXP(Var_b*'Wine production Alt'!B20+Var_c)","v":5001855.8547633924},6002,12004,2649.6984062147426,39653.698406214738,60020,20366.301593785262,78,null,"Total Revenue",null,{"$f":"VLOOKUP(X15,$A$4:$S$103,18,FALSE)","v":49980}]
[18,{"$f":"SUM(Rawdata!A18:CL18)*Max_sunhours_alt","v":646.20987574448725},{"$f":"Rawdata!CM18*Max_sunhours_alt","v":1.0805374731864998},{"$f":"Rawdata!CN18*Max_sunhours_alt","v":10.330972949551844},{"$f":"Rawdata!CO18*Max_sunhours_alt","v":1.3341177620022511},{"$f":"Rawdata!CP18*Max_sunhours_alt","v":9.300050295421368},{"$f":"Rawdata!CQ18*Max_sunhours_alt","v":4.2386423953299568},{"$f":"Rawdata!CR18*Max_sunhours_alt","v":3.5060025987880468},{"$f":"Rawdata!CS18*Max_sunhours_alt","v":9.2637882992025595},{"$f":"Rawdata!CT18*Max_sunhours_alt","v":12.913871621799185},{"$f":"Rawdata!CU18*Max_sunhours_alt","v":10.790837202519089},{"$f":"Rawdata!CV18*Max_sunhours_alt","v":14.45064319628889},{"$f":"Var_a*EXP(Var_b*'Wine production Alt'!B21+Var_c)","v":3505605.0942472331},4206,8412,2205.0163564782933,35617.016356478292,42060,6442.9836435217076,30,null,"Profit/(loss)",null,{"$f":"VLOOKUP(X15,$A$4:$S$103,19,FALSE)","v":13030.046982074462}]
[19,{"$f":"SUM(Rawdata!A19:CL19)*Max_sunhours_alt","v":711.62785608836293},{"$f":"Rawdata!CM19*Max_sunhours_alt","v":13.443465101709732},{"$f":"Rawdata!CN19*Max_sunhours_alt","v":7.5255226797422097},{"$f":"Rawdata!CO19*Max_sunhours_alt","v":8.2740803999423793},{"$f":"Rawdata!CP19*Max_sunhours_alt","v":14.040756924529029},{"$f":"Rawdata!CQ19*Max_sunhours_alt","v":4.9398480681808534},{"$f":"Rawdata!CR19*Max_sunhours_alt","v":6.752582353238501E-2},{"$f":"Rawdata!CS19*Max_sunhours_alt","v":7.3383710544914491},{"$f":"Rawdata!CT19*Max_sunhours_alt","v":12.454670440324247},{"$f":"Rawdata!CU19*Max_sunhours_alt","v":7.0978671183740003},{"$f":"Rawdata!CV19*Max_sunhours_alt","v":6.8038073340138849},{"$f":"Var_a*EXP(Var_b*'Wine production Alt'!B22+Var_c)","v":4990919.8771334998},5989,11978,1823.8495546247591,38801.849554624758,59890,21088.150445375242,81]
[20,{"$f":"SUM(Rawdata!A20:CL20)*Max_sunhours_alt","v":654.4920906638996},{"$f":"Rawdata!CM20*Max_sunhours_alt","v":11.905448389552433},{"$f":"Rawdata!CN20*Max_sunhours_alt","v":13.387185114948847},{"$f":"Rawdata!CO20*Max_sunhours_alt","v":0.89881116495448055},{"$f":"Rawdata!CP20*Max_sunhours_alt","v":14.229455606750955},{"$f":"Rawdata!CQ20*Max_sunhours_alt","v":4.5767253080154831},{"$f":"Rawdata!CR20*Max_sunhours_alt","v":14.355259289717003},{"$f":"Rawdata!CS20*Max_sunhours_alt","v":12.940255183900231},{"$f":"Rawdata!CT20*Max_sunhours_alt","v":7.4197389886586738},{"$f":"Rawdata!CU20*Max_sunhours_alt","v":0.99802691271617561},{"$f":"Rawdata!CV20*Max_sunhours_alt","v":2.3981870710451139},{"$f":"Var_a*EXP(Var_b*'Wine production Alt'!B23+Var_c)","v":3665948.5083834967},4399,8798,2931.7603584869471,36729.76035848695,43990,7260.2396415130497,33,null,"Check correct simulation",null,{"$f":"IF(X21=X20-X19,\"OK\",\"CHECK\")","v":"OK"}]
[21,{"$f":"SUM(Rawdata!A21:CL21)*Max_sunhours_alt","v":659.11288503268781},{"$f":"Rawdata!CM21*Max_sunhours_alt","v":12.412358341232846},{"$f":"Rawdata!CN21*Max_sunhours_alt","v":12.759395053527571},{"$f":"Rawdata!CO21*Max_sunhours_alt","v":1.6801687474572042},{"$f":"Rawdata!CP21*Max_sunhours_alt","v":10.938809929931283},{"$f":"Rawdata!CQ21*Max_sunhours_alt","v":7.4453000297302276},{"$f":"Rawdata!CR21*Max_sunhours_alt","v":13.969339339762769},{"$f":"Rawdata!CS21*Max_sunhours_alt","v":5.7343626241225891},{"$f":"Rawdata!CT21*Max_sunhours_alt","v":9.2116452268537579},{"$f":"Rawdata!CU21*Max_sunhours_alt","v":10.125808619089977},{"$f":"Rawdata!CV21*Max_sunhours_alt","v":12.071800019716926},{"$f":"Var_a*EXP(Var_b*'Wine production Alt'!B24+Var_c)","v":3758573.1093731327},4510,9020,2898.9156530115138,36918.915653011514,45100,8181.0843469884858,37]
[22,{"$f":"SUM(Rawdata!A22:CL22)*Max_sunhours_alt","v":662.4493448618357},{"$f":"Rawdata!CM22*Max_sunhours_alt","v":13.045163125198044},{"$f":"Rawdata!CN22*Max_sunhours_alt","v":5.5996543117650859},{"$f":"Rawdata!CO22*Max_sunhours_alt","v":4.3322186495657986},{"$f":"Rawdata!CP22*Max_sunhours_alt","v":4.1741681296247259},{"$f":"Rawdata!CQ22*Max_sunhours_alt","v":4.823843312293759},{"$f":"Rawdata!CR22*Max_sunhours_alt","v":2.0124046695252975},{"$f":"Rawdata!CS22*Max_sunhours_alt","v":8.7306639502397729},{"$f":"Rawdata!CT22*Max_sunhours_alt","v":12.971563032289444},{"$f":"Rawdata!CU22*Max_sunhours_alt","v":11.499722454526122},{"$f":"Rawdata!CV22*Max_sunhours_alt","v":6.729036086329315},{"$f":"Var_a*EXP(Var_b*'Wine production Alt'!B25+Var_c)","v":3826904.593399032},4592,9184,1624.7112562253387,35808.711256225339,45920,10111.288743774661,42]
[23,{"$f":"SUM(Rawdata!A23:CL23)*Max_sunhours_alt","v":739.99654478744208},{"$f":"Rawdata!CM23*Max_sunhours_alt","v":3.7046804065247958},{"$f":"Rawdata!CN23*Max_sunhours_alt","v":11.174055561040674},{"$f":"Rawdata!CO23*Max_sunhours_alt","v":3.6756277719875503},{"$f":"Rawdata!CP23*Max_sunhours_alt","v":8.4726008218474025},{"$f":"Rawdata!CQ23*Max_sunhours_alt","v":13.040533650076592},{"$f":"Rawdata!CR23*Max_sunhours_alt","v":13.278838909783135},{"$f":"Rawdata!CS23*Max_sunhours_alt","v":4.6458897468950884},{"$f":"Rawdata!CT23*Max_sunhours_alt","v":7.3045826847423845},{"$f":"Rawdata!CU23*Max_sunhours_alt","v":12.000684125468517},{"$f":"Rawdata!CV23*Max_sunhours_alt","v":1.9008679890182845E-2},{"$f":"Var_a*EXP(Var_b*'Wine production Alt'!B26+Var_c)","v":5817154.0998127507},6980,13960,2046.6713068216313,41006.671306821634,69800,28793.328693178366,94]
[24,{"$f":"SUM(Rawdata!A24:CL24)*Max_sunhours_alt","v":638.82829681001476},{"$f":"Rawdata!CM24*Max_sunhours_alt","v":10.548568396325674},{"$f":"Rawdata!CN24*Max_sunhours_alt","v":11.047376019205489},{"$f":"Rawdata!CO24*Max_sunhours_alt","v":1.0440725288514678},{"$f":"Rawdata!CP24*Max_sunhours_alt","v":0.47431320723056059},{"$f":"Rawdata!CQ24*Max_sunhours_alt","v":11.985792206018498},{"$f":"Rawdata!CR24*Max_sunhours_alt","v":12.803343580386034},{"$f":"Rawdata!CS24*Max_sunhours_alt","v":14.401713100029248},{"$f":"Rawdata!CT24*Max_sunhours_alt","v":10.690771208871732},{"$f":"Rawdata!CU24*Max_sunhours_alt","v":6.0419567986772869},{"$f":"Rawdata!CV24*Max_sunhours_alt","v":13.849253299150874},{"$f":"Var_a*EXP(Var_b*'Wine production Alt'!B27+Var_c)","v":3368618.1534472494},4042,8084,3282.681780998756,36366.681780998755,40420,4053.3182190012449,21]
[25,{"$f":"SUM(Rawdata!A25:CL25)*Max_sunhours_alt","v":626.50488574944507},{"$f":"Rawdata!CM25*Max_sunhours_alt","v":11.469469518268584},{"$f":"Rawdata!CN25*Max_sunhours_alt","v":8.2776856368601237},{"$f":"Rawdata!CO25*Max_sunhours_alt","v":11.932363760257894},{"$f":"Rawdata!CP25*Max_sunhours_alt","v":9.0088780271382642},{"$f":"Rawdata!CQ25*Max_sunhours_alt","v":0.22047430385108535},{"$f":"Rawdata!CR25*Max_sunhours_alt","v":9.2579924081820657},{"$f":"Rawdata!CS25*Max_sunhours_alt","v":2.6586764219970931},{"$f":"Rawdata!CT25*Max_sunhours_alt","v":8.1907621525399641},{"$f":"Rawdata!CU25*Max_sunhours_alt","v":12.357006752734478},{"$f":"Rawdata!CV25*Max_sunhours_alt","v":8.2627043832154783},{"$f":"Var_a*EXP(Var_b*'Wine production Alt'!B28+Var_c)","v":3151744.7773329173},3782,7564,1875.6862639196854,34439.686263919684,37820,3380.3137360803157,18]
[26,{"$f":"SUM(Rawdata!A26:CL26)*Max_sunhours_alt","v":773.91020832466393},{"$f":"Rawdata!CM26*Max_sunhours_alt","v":14.942533485892197},{"$f":"Rawdata!CN26*Max_sunhours_alt","v":10.753831042792989},{"$f":"Rawdata!CO26*Max_sunhours_alt","v":10.872991046355022},{"$f":"Rawdata!CP26*Max_sunhours_alt","v":14.611990966204075},{"$f":"Rawdata!CQ26*Max_sunhours_alt","v":14.503981438911605},{"$f":"Rawdata!CR26*Max_sunhours_alt","v":5.2503429237868202},{"$f":"Rawdata!CS26*Max_sunhours_alt","v":3.6649308024663965},{"$f":"Rawdata!CT26*Max_sunhours_alt","v":6.4051310415282545},{"$f":"Rawdata!CU26*Max_sunhours_alt","v":6.8862247598966499},{"$f":"Rawdata!CV26*Max_sunhours_alt","v":4.2451079423054097},{"$f":"Var_a*EXP(Var_b*'Wine production Alt'!B29+Var_c)","v":6986257.0376955587},8383,16766,2818.5327980155889,44584.532798015585,83830,39245.467201984415,99]
[27,{"$f":"SUM(Rawdata!A27:CL27)*Max_sunhours_alt","v":687.25542474069834},{"$f":"Rawdata!CM27*Max_sunhours_alt","v":9.9950878034400574},{"$f":"Rawdata!CN27*Max_sunhours_alt","v":3.2264263916985669E-2},{"$f":"Rawdata!CO27*Max_sunhours_alt","v":4.6002211146535918},{"$f":"Rawdata!CP27*Max_sunhours_alt","v":7.3696296166544037},{"$f":"Rawdata!CQ27*Max_sunhours_alt","v":13.002209212848863},{"$f":"Rawdata!CR27*Max_sunhours_alt","v":7.8665738211776741},{"$f":"Rawdata!CS27*Max_sunhours_alt","v":0.57225132824392178},{"$f":"Rawdata!CT27*Max_sunhours_alt","v":2.1711054459863197},{"$f":"Rawdata!CU27*Max_sunhours_alt","v":7.8296516139077141},{"$f":"Rawdata!CV27*Max_sunhours_alt","v":0.22384540028631938},{"$f":"Var_a*EXP(Var_b*'Wine production Alt'!B30+Var_c)","v":4375448.8446567953},5250,10500,869.3522451374306,36369.35224513743,52500,16130.64775486257,63]
[28,{"$f":"SUM(Rawdata!A28:CL28)*Max_sunhours_alt","v":611.99602690858353},{"$f":"Rawdata!CM28*Max_sunhours_alt","v":4.4567366416765415},{"$f":"Rawdata!CN28*Max_sunhours_alt","v":3.9796134879355973},{"$f":"Rawdata!CO28*Max_sunhours_alt","v":12.111044548738512},{"$f":"Rawdata!CP28*Max_sunhours_alt","v":14.589790196568984},{"$f":"Rawdata!CQ28*Max_sunhours_alt","v":11.875920246857866},{"$f":"Rawdata!CR28*Max_sunhours_alt","v":5.3501297448517295},{"$f":"Rawdata!CS28*Max_sunhours_alt","v":11.638786459964761},{"$f":"Rawdata!CT28*Max_sunhours_alt","v":9.3419944473090091},{"$f":"Rawdata!CU28*Max_sunhours_alt","v":11.64439539998523},{"$f":"Rawdata!CV28*Max_sunhours_alt","v":1.2600145943075669},{"$f":"Var_a*EXP(Var_b*'Wine production Alt'!B31+Var_c)","v":2914237.9423168954},3497,6994,2620.1931299424359,34614.193129942432,34970,355.80687005756772,8]
[29,{"$f":"SUM(Rawdata!A29:CL29)*Max_sunhours_alt","v":711.9853088128508},{"$f":"Rawdata!CM29*Max_sunhours_alt","v":9.8789629043520861},{"$f":"Rawdata!CN29*Max_sunhours_alt","v":12.680637920806822},{"$f":"Rawdata!CO29*Max_sunhours_alt","v":3.1107047216938359},{"$f":"Rawdata!CP29*Max_sunhours_alt","v":1.9148203592943047},{"$f":"Rawdata!CQ29*Max_sunhours_alt","v":9.7076871117654626},{"$f":"Rawdata!CR29*Max_sunhours_alt","v":8.4738356643415447},{"$f":"Rawdata!CS29*Max_sunhours_alt","v":14.220516602667956},{"$f":"Rawdata!CT29*Max_sunhours_alt","v":3.6056172900799277},{"$f":"Rawdata!CU29*Max_sunhours_alt","v":7.7412927523124386},{"$f":"Rawdata!CV29*Max_sunhours_alt","v":11.087725341134075},{"$f":"Var_a*EXP(Var_b*'Wine production Alt'!B32+Var_c)","v":5000562.8775167493},6000,12000,2129.0658297380387,39129.065829738043,60000,20870.934170261957,80]
[30,{"$f":"SUM(Rawdata!A30:CL30)*Max_sunhours_alt","v":664.18700563304014},{"$f":"Rawdata!CM30*Max_sunhours_alt","v":13.261372149920737},{"$f":"Rawdata!CN30*Max_sunhours_alt","v":11.309853967050971},{"$f":"Rawdata!CO30*Max_sunhours_alt","v":7.6901594673791758},{"$f":"Rawdata!CP30*Max_sunhours_alt","v":10.291749300491434},{"$f":"Rawdata!CQ30*Max_sunhours_alt","v":0.29398518869429069},{"$f":"Rawdata!CR30*Max_sunhours_alt","v":1.2617850793681811},{"$f":"Rawdata!CS30*Max_sunhours_alt","v":0.66555727155385103},{"$f":"Rawdata!CT30*Max_sunhours_alt","v":3.9550654240014986},{"$f":"Rawdata!CU30*Max_sunhours_alt","v":5.8511228917354146},{"$f":"Rawdata!CV30*Max_sunhours_alt","v":5.99359188581455},{"$f":"Var_a*EXP(Var_b*'Wine production Alt'!B33+Var_c)","v":3862982.8512005624},4635,9270,1255.3134884842316,35525.313488484229,46350,10824.686511515771,44]
[31,{"$f":"SUM(Rawdata!A31:CL31)*Max_sunhours_alt","v":625.27475418009351},{"$f":"Rawdata!CM31*Max_sunhours_alt","v":11.350275847483513},{"$f":"Rawdata!CN31*Max_sunhours_alt","v":1.5714105167091614},{"$f":"Rawdata!CO31*Max_sunhours_alt","v":11.84581609585983},{"$f":"Rawdata!CP31*Max_sunhours_alt","v":12.661428343901077},{"$f":"Rawdata!CQ31*Max_sunhours_alt","v":1.33115812177325},{"$f":"Rawdata!CR31*Max_sunhours_alt","v":7.3691518934631404},{"$f":"Rawdata!CS31*Max_sunhours_alt","v":8.6158898173128993},{"$f":"Rawdata!CT31*Max_sunhours_alt","v":7.4531892655436724},{"$f":"Rawdata!CU31*Max_sunhours_alt","v":11.071885098485408},{"$f":"Rawdata!CV31*Max_sunhours_alt","v":0.82363750856064899},{"$f":"Var_a*EXP(Var_b*'Wine production Alt'!B34+Var_c)","v":3130878.0318915914},3757,7514,1804.5295203042726,34318.529520304277,37570,3251.470479695723,16]
[32,{"$f":"SUM(Rawdata!A32:CL32)*Max_sunhours_alt","v":641.46364389355085},{"$f":"Rawdata!CM32*Max_sunhours_alt","v":6.9259789017797342},{"$f":"Rawdata!CN32*Max_sunhours_alt","v":2.1635744143409239},{"$f":"Rawdata!CO32*Max_sunhours_alt","v":13.629276337444884},{"$f":"Rawdata!CP32*Max_sunhours_alt","v":9.841110437002591},{"$f":"Rawdata!CQ32*Max_sunhours_alt","v":8.9507586761690963},{"$f":"Rawdata!CR32*Max_sunhours_alt","v":2.9950771025641347},{"$f":"Rawdata!CS32*Max_sunhours_alt","v":14.417675108552933},{"$f":"Rawdata!CT32*Max_sunhours_alt","v":10.044450216588602},{"$f":"Rawdata!CU32*Max_sunhours_alt","v":8.1876228997267066},{"$f":"Rawdata!CV32*Max_sunhours_alt","v":13.169545508959946},{"$f":"Var_a*EXP(Var_b*'Wine production Alt'!B35+Var_c)","v":3416899.2611627276},4100,8200,2574.0439184444758,35774.043918444477,41000,5225.9560815555233,28]
[33,{"$f":"SUM(Rawdata!A33:CL33)*Max_sunhours_alt","v":720.72635677363633},{"$f":"Rawdata!CM33*Max_sunhours_alt","v":3.4439354787100513},{"$f":"Rawdata!CN33*Max_sunhours_alt","v":9.2935402675726593},{"$f":"Rawdata!CO33*Max_sunhours_alt","v":12.404192983181817},{"$f":"Rawdata!CP33*Max_sunhours_alt","v":1.0930802261231394},{"$f":"Rawdata!CQ33*Max_sunhours_alt","v":1.5159271556274356},{"$f":"Rawdata!CR33*Max_sunhours_alt","v":14.52514965556766},{"$f":"Rawdata!CS33*Max_sunhours_alt","v":13.664028180817017},{"$f":"Rawdata!CT33*Max_sunhours_alt","v":8.0786398667928694},{"$f":"Rawdata!CU33*Max_sunhours_alt","v":12.365033663181919},{"$f":"Rawdata!CV33*Max_sunhours_alt","v":9.8868157262485603},{"$f":"Var_a*EXP(Var_b*'Wine production Alt'!B36+Var_c)","v":5242257.0513805216},{"$f":"ROUNDDOWN(M36*(1-Spoilage)/Grapes_per_bottle,0)","v":6290},{"$f":"N36*Prodcosts_per_bottle","v":12580},{"$f":"(SUMIF(C36:L36,\">\"&Overtime_limit_alt,C36:L36)-COUNTIF(C36:L36,\">\"&Overtime_limit_alt)*Overtime_limit_alt)\n*Number_worker_alt*Overtime_hourly_rate_alt","v":2771.7400343362497},{"$f":"O36+P36+Vineyard_cost_alt","v":40351.740034336253},{"$f":"N36*Price_per_bottle","v":62900},22548.259965663747,83]
[34,{"$f":"SUM(Rawdata!A34:CL34)*Max_sunhours_alt","v":651.74551712026164},{"$f":"Rawdata!CM34*Max_sunhours_alt","v":10.666855912126069},{"$f":"Rawdata!CN34*Max_sunhours_alt","v":2.7206833909362054},{"$f":"Rawdata!CO34*Max_sunhours_alt","v":9.6003761767505988},{"$f":"Rawdata!CP34*Max_sunhours_alt","v":11.826908184694071},{"$f":"Rawdata!CQ34*Max_sunhours_alt","v":3.0540163318766695},{"$f":"Rawdata!CR34*Max_sunhours_alt","v":8.4617726948176735},{"$f":"Rawdata!CS34*Max_sunhours_alt","v":14.052614869689229},{"$f":"Rawdata!CT34*Max_sunhours_alt","v":14.613038546955286},{"$f":"Rawdata!CU34*Max_sunhours_alt","v":4.8792642747041226},{"$f":"Rawdata!CV34*Max_sunhours_alt","v":5.1360441673651893},{"$f":"Var_a*EXP(Var_b*'Wine production Alt'!B37+Var_c)","v":3611978.2229802273},4334,8668,2422.1566385032929,36090.156638503293,43340,7249.8433614967071,32]
[35,{"$f":"SUM(Rawdata!A35:CL35)*Max_sunhours_alt","v":653.13309470414947},{"$f":"Rawdata!CM35*Max_sunhours_alt","v":5.8011088129303383},{"$f":"Rawdata!CN35*Max_sunhours_alt","v":3.5655090287747964},{"$f":"Rawdata!CO35*Max_sunhours_alt","v":12.450205507140426},{"$f":"Rawdata!CP35*Max_sunhours_alt","v":14.500894237907278},{"$f":"Rawdata!CQ35*Max_sunhours_alt","v":12.032272195114539},{"$f":"Rawdata!CR35*Max_sunhours_alt","v":2.1316045940832677},{"$f":"Rawdata!CS35*Max_sunhours_alt","v":10.833906760067084},{"$f":"Rawdata!CT35*Max_sunhours_alt","v":10.006610279709836},{"$f":"Rawdata!CU35*Max_sunhours_alt","v":3.4162484203689942},{"$f":"Rawdata!CV35*Max_sunhours_alt","v":4.0206413443598032},{"$f":"Var_a*EXP(Var_b*'Wine production Alt'!B38+Var_c)","v":3639144.1319423262},4366,8732,2232.3888979939156,35964.388897993915,43660,7695.6111020060853,35]
[36,{"$f":"SUM(Rawdata!A36:CL36)*Max_sunhours_alt","v":674.41315673302176},{"$f":"Rawdata!CM36*Max_sunhours_alt","v":8.5254670939732549},{"$f":"Rawdata!CN36*Max_sunhours_alt","v":5.9559328236347229},{"$f":"Rawdata!CO36*Max_sunhours_alt","v":9.5256717896820788},{"$f":"Rawdata!CP36*Max_sunhours_alt","v":6.7254128159794009},{"$f":"Rawdata!CQ36*Max_sunhours_alt","v":2.4742988596619151},{"$f":"Rawdata!CR36*Max_sunhours_alt","v":4.6080827162175826},{"$f":"Rawdata!CS36*Max_sunhours_alt","v":2.4543810880331578},{"$f":"Rawdata!CT36*Max_sunhours_alt","v":10.628671944769604},{"$f":"Rawdata!CU36*Max_sunhours_alt","v":14.260692377460698},{"$f":"Rawdata!CV36*Max_sunhours_alt","v":0.43848691421871311},{"$f":"Var_a*EXP(Var_b*'Wine production Alt'!B39+Var_c)","v":4082301.2463161126},4898,9796,1294.0503205885634,36090.050320588562,48980,12889.949679411438,48]
[37,{"$f":"SUM(Rawdata!A37:CL37)*Max_sunhours_alt","v":708.53723909179075},{"$f":"Rawdata!CM37*Max_sunhours_alt","v":0.6292056365157328},{"$f":"Rawdata!CN37*Max_sunhours_alt","v":0.11091986139214138},{"$f":"Rawdata!CO37*Max_sunhours_alt","v":2.0488406065333971},{"$f":"Rawdata!CP37*Max_sunhours_alt","v":0.95978772431757564},{"$f":"Rawdata!CQ37*Max_sunhours_alt","v":6.4114612942235061},{"$f":"Rawdata!CR37*Max_sunhours_alt","v":4.0041295774384311},{"$f":"Rawdata!CS37*Max_sunhours_alt","v":10.274219656080726},{"$f":"Rawdata!CT37*Max_sunhours_alt","v":11.479346822631172},{"$f":"Rawdata!CU37*Max_sunhours_alt","v":0.6609153022018438},{"$f":"Rawdata!CV37*Max_sunhours_alt","v":2.5408111867490057},{"$f":"Var_a*EXP(Var_b*'Wine production Alt'!B40+Var_c)","v":4908315.9786657179},5889,11778,675.35664787118958,37453.356647871187,58890,21436.643352128813,82]
[38,{"$f":"SUM(Rawdata!A38:CL38)*Max_sunhours_alt","v":708.57256226211268},{"$f":"Rawdata!CM38*Max_sunhours_alt","v":10.114346611628864},{"$f":"Rawdata!CN38*Max_sunhours_alt","v":1.0993864116763068},{"$f":"Rawdata!CO38*Max_sunhours_alt","v":5.1679475776438011},{"$f":"Rawdata!CP38*Max_sunhours_alt","v":13.879164575283488},{"$f":"Rawdata!CQ38*Max_sunhours_alt","v":11.671611015497087},{"$f":"Rawdata!CR38*Max_sunhours_alt","v":3.1269080899370785},{"$f":"Rawdata!CS38*Max_sunhours_alt","v":11.084329880355105},{"$f":"Rawdata!CT38*Max_sunhours_alt","v":8.2848302534651825},{"$f":"Rawdata!CU38*Max_sunhours_alt","v":12.57038912330065},{"$f":"Rawdata!CV38*Max_sunhours_alt","v":12.607934223571531},{"$f":"Var_a*EXP(Var_b*'Wine production Alt'!B41+Var_c)","v":4909252.3052818095},5891,11782,2771.260568310191,39553.260568310186,58910,19356.739431689814,75]
[39,{"$f":"SUM(Rawdata!A39:CL39)*Max_sunhours_alt","v":726.80277544076603},{"$f":"Rawdata!CM39*Max_sunhours_alt","v":4.949898786408208},{"$f":"Rawdata!CN39*Max_sunhours_alt","v":3.0886061756261842},{"$f":"Rawdata!CO39*Max_sunhours_alt","v":0.23122561867758851},{"$f":"Rawdata!CP39*Max_sunhours_alt","v":0.40409359505003573},{"$f":"Rawdata!CQ39*Max_sunhours_alt","v":12.088176603626895},{"$f":"Rawdata!CR39*Max_sunhours_alt","v":8.7628202701119129},{"$f":"Rawdata!CS39*Max_sunhours_alt","v":11.617063152014209},{"$f":"Rawdata!CT39*Max_sunhours_alt","v":14.446321890580402},{"$f":"Rawdata!CU39*Max_sunhours_alt","v":8.8476393939556992},{"$f":"Rawdata!CV39*Max_sunhours_alt","v":4.7748189062738069},{"$f":"Var_a*EXP(Var_b*'Wine production Alt'!B42+Var_c)","v":5417122.6678169919},6500,13000,1826.2021310289115,39826.202131028913,65000,25173.797868971087,90]
[40,{"$f":"SUM(Rawdata!A40:CL40)*Max_sunhours_alt","v":651.96502211460017},{"$f":"Rawdata!CM40*Max_sunhours_alt","v":3.266022373834315},{"$f":"Rawdata!CN40*Max_sunhours_alt","v":6.6135554292971364},{"$f":"Rawdata!CO40*Max_sunhours_alt","v":13.61012190521555},{"$f":"Rawdata!CP40*Max_sunhours_alt","v":13.749714543812777},{"$f":"Rawdata!CQ40*Max_sunhours_alt","v":8.9346181310737016},{"$f":"Rawdata!CR40*Max_sunhours_alt","v":7.0015884216254767},{"$f":"Rawdata!CS40*Max_sunhours_alt","v":4.4865959399938564},{"$f":"Rawdata!CT40*Max_sunhours_alt","v":4.6779901846480962},{"$f":"Rawdata!CU40*Max_sunhours_alt","v":3.5923591174242784},{"$f":"Rawdata!CV40*Max_sunhours_alt","v":2.6508147791581522},{"$f":"Var_a*EXP(Var_b*'Wine production Alt'!B43+Var_c)","v":3616262.1365985074},4339,8678,1379.4454580102026,35057.445458010203,43390,8332.5545419897971,38]
[41,{"$f":"SUM(Rawdata!A41:CL41)*Max_sunhours_alt","v":727.89249514425626},{"$f":"Rawdata!CM41*Max_sunhours_alt","v":8.5064067330680668},{"$f":"Rawdata!CN41*Max_sunhours_alt","v":7.6480625705292598},{"$f":"Rawdata!CO41*Max_sunhours_alt","v":7.2380516105892543},{"$f":"Rawdata!CP41*Max_sunhours_alt","v":3.0421438552181406},{"$f":"Rawdata!CQ41*Max_sunhours_alt","v":11.324932964874751},{"$f":"Rawdata!CR41*Max_sunhours_alt","v":8.1510396745500717},{"$f":"Rawdata!CS41*Max_sunhours_alt","v":13.974923779803138},{"$f":"Rawdata!CT41*Max_sunhours_alt","v":1.8893669045098975},{"$f":"Rawdata!CU41*Max_sunhours_alt","v":6.6541200650620027},{"$f":"Rawdata!CV41*Max_sunhours_alt","v":7.3757974088717884},{"$f":"Var_a*EXP(Var_b*'Wine production Alt'!B44+Var_c)","v":5449093.6265572896},6538,13076,1210.5365722825284,39286.53657228253,65380,26093.46342771747,91]
[42,{"$f":"SUM(Rawdata!A42:CL42)*Max_sunhours_alt","v":694.51097119276722},{"$f":"Rawdata!CM42*Max_sunhours_alt","v":11.14634296632955},{"$f":"Rawdata!CN42*Max_sunhours_alt","v":12.044157604272186},{"$f":"Rawdata!CO42*Max_sunhours_alt","v":12.450020364965917},{"$f":"Rawdata!CP42*Max_sunhours_alt","v":3.6354841140428178},{"$f":"Rawdata!CQ42*Max_sunhours_alt","v":0.60635472604036622},{"$f":"Rawdata!CR42*Max_sunhours_alt","v":8.5743644958751251},{"$f":"Rawdata!CS42*Max_sunhours_alt","v":6.7056159755721181},{"$f":"Rawdata!CT42*Max_sunhours_alt","v":6.7531184496742362},{"$f":"Rawdata!CU42*Max_sunhours_alt","v":14.405479430707295},{"$f":"Rawdata!CV42*Max_sunhours_alt","v":5.258545944145097},{"$f":"Var_a*EXP(Var_b*'Wine production Alt'!B45+Var_c)","v":4550281.3146755844},5460,10920,2112.0364862150068,38032.036486215009,54600,16567.963513784991,66]
[43,{"$f":"SUM(Rawdata!A43:CL43)*Max_sunhours_alt","v":703.29983459428377},{"$f":"Rawdata!CM43*Max_sunhours_alt","v":2.96126563817749},{"$f":"Rawdata!CN43*Max_sunhours_alt","v":12.946893051808068},{"$f":"Rawdata!CO43*Max_sunhours_alt","v":0.26256999262933178},{"$f":"Rawdata!CP43*Max_sunhours_alt","v":0.80012952752677113},{"$f":"Rawdata!CQ43*Max_sunhours_alt","v":9.4807894883308599},{"$f":"Rawdata!CR43*Max_sunhours_alt","v":10.001963411774241},{"$f":"Rawdata!CS43*Max_sunhours_alt","v":1.6845505303215629},{"$f":"Rawdata!CT43*Max_sunhours_alt","v":12.275339320068909},{"$f":"Rawdata!CU43*Max_sunhours_alt","v":10.25995565482239},{"$f":"Rawdata!CV43*Max_sunhours_alt","v":2.58862919068849},{"$f":"Var_a*EXP(Var_b*'Wine production Alt'!B46+Var_c)","v":4771443.6963739125},5725,11450,1746.4940926804475,38196.494092680448,57250,19053.505907319552,74]
[44,{"$f":"SUM(Rawdata!A44:CL44)*Max_sunhours_alt","v":630.45408470267944},{"$f":"Rawdata!CM44*Max_sunhours_alt","v":8.5203372264986683},{"$f":"Rawdata!CN44*Max_sunhours_alt","v":13.58741276550874},{"$f":"Rawdata!CO44*Max_sunhours_alt","v":13.753616978603155},{"$f":"Rawdata!CP44*Max_sunhours_alt","v":0.35170473615592168},{"$f":"Rawdata!CQ44*Max_sunhours_alt","v":8.3594769062425129},{"$f":"Rawdata!CR44*Max_sunhours_alt","v":10.953540374099337},{"$f":"Rawdata!CS44*Max_sunhours_alt","v":14.834297055910481},{"$f":"Rawdata!CT44*Max_sunhours_alt","v":8.5086739505185367},{"$f":"Rawdata!CU44*Max_sunhours_alt","v":1.6785286614843675},{"$f":"Rawdata!CV44*Max_sunhours_alt","v":0.57049145436595505},{"$f":"Var_a*EXP(Var_b*'Wine production Alt'!B47+Var_c)","v":3219679.6640922753},3863,7726,2601.7355257381441,35327.735525738142,38630,3302.2644742618577,17]
[45,{"$f":"SUM(Rawdata!A45:CL45)*Max_sunhours_alt","v":678.14358747563153},{"$f":"Rawdata!CM45*Max_sunhours_alt","v":10.075160945173181},{"$f":"Rawdata!CN45*Max_sunhours_alt","v":12.082788368920985},{"$f":"Rawdata!CO45*Max_sunhours_alt","v":9.3652027322997444},{"$f":"Rawdata!CP45*Max_sunhours_alt","v":0.94494634749926365},{"$f":"Rawdata!CQ45*Max_sunhours_alt","v":7.7058241413415667},{"$f":"Rawdata!CR45*Max_sunhours_alt","v":8.8063208898117935},{"$f":"Rawdata!CS45*Max_sunhours_alt","v":0.72686170209721845},{"$f":"Rawdata!CT45*Max_sunhours_alt","v":9.4529193504370514},{"$f":"Rawdata!CU45*Max_sunhours_alt","v":5.6483108027930777},{"$f":"Rawdata!CV45*Max_sunhours_alt","v":14.551313751271088},{"$f":"Var_a*EXP(Var_b*'Wine production Alt'!B48+Var_c)","v":4165370.3297846112},4998,9996,1953.9530179255407,36949.953017925538,49980,13030.046982074462,50]
[46,{"$f":"SUM(Rawdata!A46:CL46)*Max_sunhours_alt","v":684.85696326999778},{"$f":"Rawdata!CM46*Max_sunhours_alt","v":12.710989265329134},{"$f":"Rawdata!CN46*Max_sunhours_alt","v":5.8484128923882501},{"$f":"Rawdata!CO46*Max_sunhours_alt","v":13.166006265460725},{"$f":"Rawdata!CP46*Max_sunhours_alt","v":8.6223732249796647},{"$f":"Rawdata!CQ46*Max_sunhours_alt","v":11.317476570837089},{"$f":"Rawdata!CR46*Max_sunhours_alt","v":13.76177015754295},{"$f":"Rawdata!CS46*Max_sunhours_alt","v":3.5852700973233871},{"$f":"Rawdata!CT46*Max_sunhours_alt","v":12.598433307478036},{"$f":"Rawdata!CU46*Max_sunhours_alt","v":9.8402270684711066},{"$f":"Rawdata!CV46*Max_sunhours_alt","v":4.1275297622772378},{"$f":"Var_a*EXP(Var_b*'Wine production Alt'!B49+Var_c)","v":4319144.7826115293},5182,10364,2951.7275860098707,38315.727586009874,51820,13504.272413990126,55]
[47,{"$f":"SUM(Rawdata!A47:CL47)*Max_sunhours_alt","v":694.68831855266239},{"$f":"Rawdata!CM47*Max_sunhours_alt","v":3.2084484286171788},{"$f":"Rawdata!CN47*Max_sunhours_alt","v":13.226684754425833},{"$f":"Rawdata!CO47*Max_sunhours_alt","v":11.73961113216841},{"$f":"Rawdata!CP47*Max_sunhours_alt","v":14.730842354066846},{"$f":"Rawdata!CQ47*Max_sunhours_alt","v":14.632161994627472},{"$f":"Rawdata!CR47*Max_sunhours_alt","v":5.9861851979342697},{"$f":"Rawdata!CS47*Max_sunhours_alt","v":4.6617828200078257},{"$f":"Rawdata!CT47*Max_sunhours_alt","v":10.738037133864719},{"$f":"Rawdata!CU47*Max_sunhours_alt","v":10.349288320236356},{"$f":"Rawdata!CV47*Max_sunhours_alt","v":2.040008310532837},{"$f":"Var_a*EXP(Var_b*'Wine production Alt'!B50+Var_c)","v":4554641.0960116545},5465,10930,3041.6625689389634,38971.662568938962,54650,15678.337431061038,60]
[48,{"$f":"SUM(Rawdata!A48:CL48)*Max_sunhours_alt","v":594.51815798404743},{"$f":"Rawdata!CM48*Max_sunhours_alt","v":5.6432591990638521},{"$f":"Rawdata!CN48*Max_sunhours_alt","v":3.0923339181972755},{"$f":"Rawdata!CO48*Max_sunhours_alt","v":5.2873910663511712},{"$f":"Rawdata!CP48*Max_sunhours_alt","v":3.3195337803741638},{"$f":"Rawdata!CQ48*Max_sunhours_alt","v":2.3448146986083107},{"$f":"Rawdata!CR48*Max_sunhours_alt","v":9.9977964873143943},{"$f":"Rawdata!CS48*Max_sunhours_alt","v":6.5720496093564904},{"$f":"Rawdata!CT48*Max_sunhours_alt","v":8.4871503486971225},{"$f":"Rawdata!CU48*Max_sunhours_alt","v":13.980667315438247},{"$f":"Rawdata!CV48*Max_sunhours_alt","v":5.633322914415027},{"$f":"Var_a*EXP(Var_b*'Wine production Alt'!B51+Var_c)","v":2651771.3936689692},3182,6364,996.56141514497631,32360.561415144977,31820,-540.56141514497722,7]
[49,{"$f":"SUM(Rawdata!A49:CL49)*Max_sunhours_alt","v":703.70298659569391},{"$f":"Rawdata!CM49*Max_sunhours_alt","v":8.5446447254859361},{"$f":"Rawdata!CN49*Max_sunhours_alt","v":12.638887797597521},{"$f":"Rawdata!CO49*Max_sunhours_alt","v":4.7942581236475714},{"$f":"Rawdata!CP49*Max_sunhours_alt","v":4.9563517683966305},{"$f":"Rawdata!CQ49*Max_sunhours_alt","v":11.537481807545969},{"$f":"Rawdata!CR49*Max_sunhours_alt","v":4.9747957042682485},{"$f":"Rawdata!CS49*Max_sunhours_alt","v":7.1273625090188126},{"$f":"Rawdata!CT49*Max_sunhours_alt","v":8.1745292069757305},{"$f":"Rawdata!CU49*Max_sunhours_alt","v":3.9927075497462061},{"$f":"Rawdata!CV49*Max_sunhours_alt","v":6.2650003830743701},{"$f":"Var_a*EXP(Var_b*'Wine production Alt'!B52+Var_c)","v":4781842.5437297747},5738,11476,1089.5543537605163,37565.554353760512,57380,19814.445646239488,76]
[50,{"$f":"SUM(Rawdata!A50:CL50)*Max_sunhours_alt","v":776.24719040728553},{"$f":"Rawdata!CM50*Max_sunhours_alt","v":3.0752494288068215},{"$f":"Rawdata!CN50*Max_sunhours_alt","v":13.1219999174546},{"$f":"Rawdata!CO50*Max_sunhours_alt","v":6.6386198005047952},{"$f":"Rawdata!CP50*Max_sunhours_alt","v":13.629047958536592},{"$f":"Rawdata!CQ50*Max_sunhours_alt","v":6.2795973623690884},{"$f":"Rawdata!CR50*Max_sunhours_alt","v":11.118635577367648},{"$f":"Rawdata!CS50*Max_sunhours_alt","v":11.519922106200225},{"$f":"Rawdata!CT50*Max_sunhours_alt","v":10.821701538528808},{"$f":"Rawdata!CU50*Max_sunhours_alt","v":1.9859356661169487},{"$f":"Rawdata!CV50*Max_sunhours_alt","v":5.0287481347950216},{"$f":"Var_a*EXP(Var_b*'Wine production Alt'!B53+Var_c)","v":7074980.1807025541},8489,16978,2271.1307098087873,44249.130709808785,84890,40640.869290191215,100]
[51,{"$f":"SUM(Rawdata!A51:CL51)*Max_sunhours_alt","v":752.54104578164788},{"$f":"Rawdata!CM51*Max_sunhours_alt","v":5.678160160266791},{"$f":"Rawdata!CN51*Max_sunhours_alt","v":9.2365305213023401},{"$f":"Rawdata!CO51*Max_sunhours_alt","v":6.1737636937378282},{"$f":"Rawdata!CP51*Max_sunhours_alt","v":2.2931689038762659},{"$f":"Rawdata!CQ51*Max_sunhours_alt","v":9.9936200551628449},{"$f":"Rawdata!CR51*Max_sunhours_alt","v":4.4971829890372206},{"$f":"Rawdata!CS51*Max_sunhours_alt","v":11.684110851844332},{"$f":"Rawdata!CT51*Max_sunhours_alt","v":1.137053242798733},{"$f":"Rawdata!CU51*Max_sunhours_alt","v":0.54721628463598737},{"$f":"Rawdata!CV51*Max_sunhours_alt","v":13.447352782208135},{"$f":"Var_a*EXP(Var_b*'Wine production Alt'!B54+Var_c)","v":6224863.1690445272},7469,14938,1436.161421051765,41374.161421051766,74690,33315.838578948234,97]
[52,{"$f":"SUM(Rawdata!A52:CL52)*Max_sunhours_alt","v":690.10577279309018},{"$f":"Rawdata!CM52*Max_sunhours_alt","v":1.262055808350212},{"$f":"Rawdata!CN52*Max_sunhours_alt","v":4.6335407698524849},{"$f":"Rawdata!CO52*Max_sunhours_alt","v":11.264697917559113},{"$f":"Rawdata!CP52*Max_sunhours_alt","v":14.119671083594545},{"$f":"Rawdata!CQ52*Max_sunhours_alt","v":14.553008087556915},{"$f":"Rawdata!CR52*Max_sunhours_alt","v":11.592399617908512},{"$f":"Rawdata!CS52*Max_sunhours_alt","v":3.1568880327055493},{"$f":"Rawdata!CT52*Max_sunhours_alt","v":14.518914219599464},{"$f":"Rawdata!CU52*Max_sunhours_alt","v":13.530182069270609},{"$f":"Rawdata!CV52*Max_sunhours_alt","v":4.8655468067557566},{"$f":"Var_a*EXP(Var_b*'Wine production Alt'!B55+Var_c)","v":4443316.1890850514},5331,10662,3457.8872995489164,39119.887299548915,53310,14190.112700451085,57]
[53,{"$f":"SUM(Rawdata!A53:CL53)*Max_sunhours_alt","v":635.8318114379407},{"$f":"Rawdata!CM53*Max_sunhours_alt","v":13.675199308748248},{"$f":"Rawdata!CN53*Max_sunhours_alt","v":6.2469649099371729},{"$f":"Rawdata!CO53*Max_sunhours_alt","v":10.847992068038579},{"$f":"Rawdata!CP53*Max_sunhours_alt","v":0.78192093296722609},{"$f":"Rawdata!CQ53*Max_sunhours_alt","v":1.0222783833807263},{"$f":"Rawdata!CR53*Max_sunhours_alt","v":0.19255575740517006},{"$f":"Rawdata!CS53*Max_sunhours_alt","v":11.396361489042155},{"$f":"Rawdata!CT53*Max_sunhours_alt","v":4.2807513192674067},{"$f":"Rawdata!CU53*Max_sunhours_alt","v":6.6221982306678377},{"$f":"Rawdata!CV53*Max_sunhours_alt","v":14.041179074989126},{"$f":"Var_a*EXP(Var_b*'Wine production Alt'!B56+Var_c)","v":3314549.0983089521},3977,7954,1996.0731940818107,34950.073194081808,39770,4819.9268059181923,24]
[54,{"$f":"SUM(Rawdata!A54:CL54)*Max_sunhours_alt","v":624.71566869562832},{"$f":"Rawdata!CM54*Max_sunhours_alt","v":14.230508564582934},{"$f":"Rawdata!CN54*Max_sunhours_alt","v":1.1852548663665874},{"$f":"Rawdata!CO54*Max_sunhours_alt","v":8.2183870193948625},{"$f":"Rawdata!CP54*Max_sunhours_alt","v":12.811666008130548},{"$f":"Rawdata!CQ54*Max_sunhours_alt","v":10.886403573196086},{"$f":"Rawdata!CR54*Max_sunhours_alt","v":5.4998113410701821},{"$f":"Rawdata!CS54*Max_sunhours_alt","v":3.2009663514387796},{"$f":"Rawdata!CT54*Max_sunhours_alt","v":9.9244382221451364},{"$f":"Rawdata!CU54*Max_sunhours_alt","v":11.245990825253289},{"$f":"Rawdata!CV54*Max_sunhours_alt","v":7.7255953156386941},{"$f":"Var_a*EXP(Var_b*'Wine production Alt'!B57+Var_c)","v":3121439.9724111143},3745,7490,2254.298952834155,34744.298952834157,37450,2705.7010471658432,13]
[55,{"$f":"SUM(Rawdata!A55:CL55)*Max_sunhours_alt","v":750.34372693608088},{"$f":"Rawdata!CM55*Max_sunhours_alt","v":12.959824574072428},{"$f":"Rawdata!CN55*Max_sunhours_alt","v":7.4983222929636426},{"$f":"Rawdata!CO55*Max_sunhours_alt","v":7.2777831019945198},{"$f":"Rawdata!CP55*Max_sunhours_alt","v":11.405552218692254},{"$f":"Rawdata!CQ55*Max_sunhours_alt","v":10.617116680677281},{"$f":"Rawdata!CR55*Max_sunhours_alt","v":0.53920377040082013},{"$f":"Rawdata!CS55*Max_sunhours_alt","v":11.208732191187591},{"$f":"Rawdata!CT55*Max_sunhours_alt","v":8.0630699816250484},{"$f":"Rawdata!CU55*Max_sunhours_alt","v":5.8686114679301475},{"$f":"Rawdata!CV55*Max_sunhours_alt","v":1.7231829957022367},{"$f":"Var_a*EXP(Var_b*'Wine production Alt'!B58+Var_c)","v":6151438.3927201759},7381,14762,1675.4295646254604,41437.429564625461,73810,32372.570435374539,96]
[56,{"$f":"SUM(Rawdata!A56:CL56)*Max_sunhours_alt","v":614.99826610202967},{"$f":"Rawdata!CM56*Max_sunhours_alt","v":1.6147798020541648},{"$f":"Rawdata!CN56*Max_sunhours_alt","v":6.7282055617784078},{"$f":"Rawdata!CO56*Max_sunhours_alt","v":11.503339127100086},{"$f":"Rawdata!CP56*Max_sunhours_alt","v":5.3411334425828167},{"$f":"Rawdata!CQ56*Max_sunhours_alt","v":9.5669547446041072},{"$f":"Rawdata!CR56*Max_sunhours_alt","v":5.5981657095280104},{"$f":"Rawdata!CS56*Max_sunhours_alt","v":4.5145102763914089},{"$f":"Rawdata!CT56*Max_sunhours_alt","v":8.5043908890253839},{"$f":"Rawdata!CU56*Max_sunhours_alt","v":7.4940604600114167},{"$f":"Rawdata!CV56*Max_sunhours_alt","v":6.8435276132196368},{"$f":"Var_a*EXP(Var_b*'Wine production Alt'!B59+Var_c)","v":2961868.8903191295},3554,7108,707.46847607295786,32815.468476072958,35540,2724.5315239270421,14]
[57,{"$f":"SUM(Rawdata!A57:CL57)*Max_sunhours_alt","v":736.5786892390563},{"$f":"Rawdata!CM57*Max_sunhours_alt","v":3.6264191466609614},{"$f":"Rawdata!CN57*Max_sunhours_alt","v":2.9937347917489681},{"$f":"Rawdata!CO57*Max_sunhours_alt","v":6.4647118312870955},{"$f":"Rawdata!CP57*Max_sunhours_alt","v":13.453279359163934},{"$f":"Rawdata!CQ57*Max_sunhours_alt","v":14.45644455534012},{"$f":"Rawdata!CR57*Max_sunhours_alt","v":8.9237303273145283},{"$f":"Rawdata!CS57*Max_sunhours_alt","v":3.2965627746191477},{"$f":"Rawdata!CT57*Max_sunhours_alt","v":1.9910006477439275},{"$f":"Rawdata!CU57*Max_sunhours_alt","v":6.5400568585248342},{"$f":"Rawdata!CV57*Max_sunhours_alt","v":11.087482404483421},{"$f":"Var_a*EXP(Var_b*'Wine production Alt'!B60+Var_c)","v":5710774.9694464765},6852,13704,1792.0936646302011,40496.0936646302,68520,28023.9063353698,93]
[58,{"$f":"SUM(Rawdata!A58:CL58)*Max_sunhours_alt","v":614.75142403570692},{"$f":"Rawdata!CM58*Max_sunhours_alt","v":12.402558479791853},{"$f":"Rawdata!CN58*Max_sunhours_alt","v":6.7290955375467787},{"$f":"Rawdata!CO58*Max_sunhours_alt","v":6.1770775523891617},{"$f":"Rawdata!CP58*Max_sunhours_alt","v":5.6839867921459897E-3},{"$f":"Rawdata!CQ58*Max_sunhours_alt","v":5.4986649868882083},{"$f":"Rawdata!CR58*Max_sunhours_alt","v":5.4763454939407499},{"$f":"Rawdata!CS58*Max_sunhours_alt","v":12.288793318133761},{"$f":"Rawdata!CT58*Max_sunhours_alt","v":11.50016382021129},{"$f":"Rawdata!CU58*Max_sunhours_alt","v":9.0864369811326036},{"$f":"Rawdata!CV58*Max_sunhours_alt","v":5.4394684731186063},{"$f":"Var_a*EXP(Var_b*'Wine production Alt'!B61+Var_c)","v":2957923.5056777704},3549,7098,1527.7952599269511,33625.795259926948,35490,1864.2047400730517,12]
[59,{"$f":"SUM(Rawdata!A59:CL59)*Max_sunhours_alt","v":671.8984004946052},{"$f":"Rawdata!CM59*Max_sunhours_alt","v":0.16042711719946257},{"$f":"Rawdata!CN59*Max_sunhours_alt","v":10.431506131254045},{"$f":"Rawdata!CO59*Max_sunhours_alt","v":0.6061658467670511},{"$f":"Rawdata!CP59*Max_sunhours_alt","v":0.51669341521106693},{"$f":"Rawdata!CQ59*Max_sunhours_alt","v":11.938756758155185},{"$f":"Rawdata!CR59*Max_sunhours_alt","v":4.2562160537440432},{"$f":"Rawdata!CS59*Max_sunhours_alt","v":6.8103884336505986},{"$f":"Rawdata!CT59*Max_sunhours_alt","v":3.1929637172692065},{"$f":"Rawdata!CU59*Max_sunhours_alt","v":2.0161242629327081},{"$f":"Rawdata!CV59*Max_sunhours_alt","v":5.237836412091462},{"$f":"Var_a*EXP(Var_b*'Wine production Alt'!B62+Var_c)","v":4027239.5927409944},4832,9664,737.026288940923,35401.02628894092,48320,12918.97371105908,49]
[60,{"$f":"SUM(Rawdata!A60:CL60)*Max_sunhours_alt","v":702.64858259110815},{"$f":"Rawdata!CM60*Max_sunhours_alt","v":8.2190747047869444},{"$f":"Rawdata!CN60*Max_sunhours_alt","v":11.081310996457249},{"$f":"Rawdata!CO60*Max_sunhours_alt","v":3.094391925792912},{"$f":"Rawdata!CP60*Max_sunhours_alt","v":14.713167883254426},{"$f":"Rawdata!CQ60*Max_sunhours_alt","v":9.8879100701663969},{"$f":"Rawdata!CR60*Max_sunhours_alt","v":3.5547411427391502},{"$f":"Rawdata!CS60*Max_sunhours_alt","v":7.6022890663911271},{"$f":"Rawdata!CT60*Max_sunhours_alt","v":13.456046488291188},{"$f":"Rawdata!CU60*Max_sunhours_alt","v":0.10395088124978469},{"$f":"Rawdata!CV60*Max_sunhours_alt","v":2.7350522849558949},{"$f":"Var_a*EXP(Var_b*'Wine production Alt'!B63+Var_c)","v":4754693.1412529191},5705,11410,1995.9799209347339,38405.979920934733,57050,18644.020079065267,73]
[61,{"$f":"SUM(Rawdata!A61:CL61)*Max_sunhours_alt","v":639.76599175965407},{"$f":"Rawdata!CM61*Max_sunhours_alt","v":14.098383616973674},{"$f":"Rawdata!CN61*Max_sunhours_alt","v":12.793209577866097},{"$f":"Rawdata!CO61*Max_sunhours_alt","v":14.466402967025036},{"$f":"Rawdata!CP61*Max_sunhours_alt","v":5.7338868143185389},{"$f":"Rawdata!CQ61*Max_sunhours_alt","v":7.4245596927693045},{"$f":"Rawdata!CR61*Max_sunhours_alt","v":2.9473847604089269},{"$f":"Rawdata!CS61*Max_sunhours_alt","v":1.5841099931888858},{"$f":"Rawdata!CT61*Max_sunhours_alt","v":3.4697432606842105},{"$f":"Rawdata!CU61*Max_sunhours_alt","v":0.61626481960220914},{"$f":"Rawdata!CV61*Max_sunhours_alt","v":13.926434644613025},{"$f":"Var_a*EXP(Var_b*'Wine production Alt'!B64+Var_c)","v":3385718.5870241565},4062,8124,2528.4430806477831,35652.443080647783,40620,4967.5569193522169,25]
[62,{"$f":"SUM(Rawdata!A62:CL62)*Max_sunhours_alt","v":624.89158517729766},{"$f":"Rawdata!CM62*Max_sunhours_alt","v":8.1953810247576069},{"$f":"Rawdata!CN62*Max_sunhours_alt","v":9.4845365746600461},{"$f":"Rawdata!CO62*Max_sunhours_alt","v":14.423266866328371},{"$f":"Rawdata!CP62*Max_sunhours_alt","v":0.95312718284524034},{"$f":"Rawdata!CQ62*Max_sunhours_alt","v":9.4653450196023758},{"$f":"Rawdata!CR62*Max_sunhours_alt","v":0.19958339797365665},{"$f":"Rawdata!CS62*Max_sunhours_alt","v":9.5422602815113553},{"$f":"Rawdata!CT62*Max_sunhours_alt","v":5.5066858181444029},{"$f":"Rawdata!CU62*Max_sunhours_alt","v":8.3659173711974173},{"$f":"Rawdata!CV62*Max_sunhours_alt","v":6.2480222684834938},{"$f":"Var_a*EXP(Var_b*'Wine production Alt'!B65+Var_c)","v":3124406.5900392672},3749,7498,1447.6707138057172,33945.670713805717,37490,3544.3292861942828,19]
[63,{"$f":"SUM(Rawdata!A63:CL63)*Max_sunhours_alt","v":693.28157510025665},{"$f":"Rawdata!CM63*Max_sunhours_alt","v":6.6272822227143813},{"$f":"Rawdata!CN63*Max_sunhours_alt","v":14.604768066023018},{"$f":"Rawdata!CO63*Max_sunhours_alt","v":1.3493427209583291},{"$f":"Rawdata!CP63*Max_sunhours_alt","v":12.555070727783988},{"$f":"Rawdata!CQ63*Max_sunhours_alt","v":9.1538005163818763},{"$f":"Rawdata!CR63*Max_sunhours_alt","v":14.883284644557722},{"$f":"Rawdata!CS63*Max_sunhours_alt","v":4.2633149053918293},{"$f":"Rawdata!CT63*Max_sunhours_alt","v":9.600291330125561},{"$f":"Rawdata!CU63*Max_sunhours_alt","v":4.0270401765509103},{"$f":"Rawdata!CV63*Max_sunhours_alt","v":7.1280622723629374},{"$f":"Var_a*EXP(Var_b*'Wine production Alt'!B66+Var_c)","v":4520173.2355250474},5424,10848,2329.7215284872168,38177.721528487215,54240,16062.278471512785,62]
[64,{"$f":"SUM(Rawdata!A64:CL64)*Max_sunhours_alt","v":683.59194924097403},{"$f":"Rawdata!CM64*Max_sunhours_alt","v":12.271126521530174},{"$f":"Rawdata!CN64*Max_sunhours_alt","v":7.248478274838611},{"$f":"Rawdata!CO64*Max_sunhours_alt","v":7.6457530292129894},{"$f":"Rawdata!CP64*Max_sunhours_alt","v":1.229935346534698},{"$f":"Rawdata!CQ64*Max_sunhours_alt","v":8.2846903602844897},{"$f":"Rawdata!CR64*Max_sunhours_alt","v":10.357526968576531},{"$f":"Rawdata!CS64*Max_sunhours_alt","v":1.0118119018523259},{"$f":"Rawdata!CT64*Max_sunhours_alt","v":14.013527787036194},{"$f":"Rawdata!CU64*Max_sunhours_alt","v":5.5959309928109651},{"$f":"Rawdata!CV64*Max_sunhours_alt","v":13.372742501731144},{"$f":"Var_a*EXP(Var_b*'Wine production Alt'!B67+Var_c)","v":4289740.9217385538},5147,10294,2094.5367168371517,37388.536716837152,51470,14081.463283162848,56]
[65,{"$f":"SUM(Rawdata!A65:CL65)*Max_sunhours_alt","v":699.03738879534785},{"$f":"Rawdata!CM65*Max_sunhours_alt","v":6.3977769039103709},{"$f":"Rawdata!CN65*Max_sunhours_alt","v":7.094524063479783},{"$f":"Rawdata!CO65*Max_sunhours_alt","v":8.9985803097370631},{"$f":"Rawdata!CP65*Max_sunhours_alt","v":12.615095119425989},{"$f":"Rawdata!CQ65*Max_sunhours_alt","v":14.946077999824471},{"$f":"Rawdata!CR65*Max_sunhours_alt","v":9.8183515500011449},{"$f":"Rawdata!CS65*Max_sunhours_alt","v":9.6149287018348275},{"$f":"Rawdata!CT65*Max_sunhours_alt","v":7.5732327951382716},{"$f":"Rawdata!CU65*Max_sunhours_alt","v":13.781293963032288},{"$f":"Rawdata!CV65*Max_sunhours_alt","v":7.3563336560032804},{"$f":"Var_a*EXP(Var_b*'Wine production Alt'!B68+Var_c)","v":4662872.6816968322},{"$f":"ROUNDDOWN(M68*(1-Spoilage)/Grapes_per_bottle,0)","v":5595},{"$f":"N68*Prodcosts_per_bottle","v":11190},{"$f":"(SUMIF(C68:L68,\">\"&Overtime_limit_alt,C68:L68)-COUNTIF(C68:L68,\">\"&Overtime_limit_alt)*Overtime_limit_alt)\n*Number_worker_alt*Overtime_hourly_rate_alt","v":2484.7560438994051},{"$f":"O68+P68+Vineyard_cost_alt","v":38674.756043899404},{"$f":"N68*Price_per_bottle","v":55950},17275.243956100596,69]
[66,{"$f":"SUM(Rawdata!A66:CL66)*Max_sunhours_alt","v":575.47015741022869},{"$f":"Rawdata!CM66*Max_sunhours_alt","v":9.6996954880161965},{"$f":"Rawdata!CN66*Max_sunhours_alt","v":9.7830902971028948},{"$f":"Rawdata!CO66*Max_sunhours_alt","v":14.653321491367576},{"$f":"Rawdata!CP66*Max_sunhours_alt","v":12.542806317778622},{"$f":"Rawdata!CQ66*Max_sunhours_alt","v":5.0432674791125702},{"$f":"Rawdata!CR66*Max_sunhours_alt","v":2.2717628420438629},{"$f":"Rawdata!CS66*Max_sunhours_alt","v":10.211933700585746},{"$f":"Rawdata!CT66*Max_sunhours_alt","v":10.618073207676066},{"$f":"Rawdata!CU66*Max_sunhours_alt","v":7.7483365834982472},{"$f":"Rawdata!CV66*Max_sunhours_alt","v":4.5585115970481329},{"$f":"Var_a*EXP(Var_b*'Wine production Alt'!B69+Var_c)","v":2392571.3446533275},2871,5742,2275.7257086025347,33017.725708602535,28710,{"$f":"R69-Q69","v":-4307.7257086025347},{"$f":"RANK(S69,$S$4:$S$103,1)","v":2}]
[{"$f":"A69+1","v":67},{"$f":"SUM(Rawdata!A67:CL67)*Max_sunhours_alt","v":697.73899389451708},{"$f":"Rawdata!CM67*Max_sunhours_alt","v":0.98056320283886778},{"$f":"Rawdata!CN67*Max_sunhours_alt","v":13.242071832328822},{"$f":"Rawdata!CO67*Max_sunhours_alt","v":12.655985171765288},{"$f":"Rawdata!CP67*Max_sunhours_alt","v":1.5785125172773888},{"$f":"Rawdata!CQ67*Max_sunhours_alt","v":7.5387901954771639},{"$f":"Rawdata!CR67*Max_sunhours_alt","v":0.82671530433437501},{"$f":"Rawdata!CS67*Max_sunhours_alt","v":7.0414454082422528E-2},{"$f":"Rawdata!CT67*Max_sunhours_alt","v":10.661780263782386},{"$f":"Rawdata!CU67*Max_sunhours_alt","v":13.053747531987643},{"$f":"Rawdata!CV67*Max_sunhours_alt","v":3.5334003998592856},{"$f":"Var_a*EXP(Var_b*'Wine production Alt'!B70+Var_c)","v":4630294.074270119},5556,11112,1965.2374995341304,38077.237499534131,55560,17482.762500465869,70]
[68,{"$f":"SUM(Rawdata!A68:CL68)*Max_sunhours_alt","v":577.76690514632207},{"$f":"Rawdata!CM68*Max_sunhours_alt","v":7.6098268953250949},{"$f":"Rawdata!CN68*Max_sunhours_alt","v":11.835089438347264},{"$f":"Rawdata!CO68*Max_sunhours_alt","v":10.699586848474398},{"$f":"Rawdata!CP68*Max_sunhours_alt","v":13.714147950907432},{"$f":"Rawdata!CQ68*Max_sunhours_alt","v":10.564946270989573},{"$f":"Rawdata!CR68*Max_sunhours_alt","v":4.1046472139615853},{"$f":"Rawdata!CS68*Max_sunhours_alt","v":0.83330410717432912},{"$f":"Rawdata!CT68*Max_sunhours_alt","v":0.11065877304335725},{"$f":"Rawdata!CU68*Max_sunhours_alt","v":9.0664404640137288},{"$f":"Rawdata!CV68*Max_sunhours_alt","v":2.1098000838717406},{"$f":"Var_a*EXP(Var_b*'Wine production Alt'!B71+Var_c)","v":2422429.8381952206},2906,5812,1849.0037868057493,32661.003786805748,29060,-3601.0037868057479,3]
[69,{"$f":"SUM(Rawdata!A69:CL69)*Max_sunhours_alt","v":609.76385946279026},{"$f":"Rawdata!CM69*Max_sunhours_alt","v":2.0719799841165107},{"$f":"Rawdata!CN69*Max_sunhours_alt","v":5.4149411185381835},{"$f":"Rawdata!CO69*Max_sunhours_alt","v":14.823791640015504},{"$f":"Rawdata!CP69*Max_sunhours_alt","v":3.9760589571834486},{"$f":"Rawdata!CQ69*Max_sunhours_alt","v":12.474213425838325},{"$f":"Rawdata!CR69*Max_sunhours_alt","v":4.0496229799816721},{"$f":"Rawdata!CS69*Max_sunhours_alt","v":1.2040987144500481},{"$f":"Rawdata!CT69*Max_sunhours_alt","v":4.9820962731154586},{"$f":"Rawdata!CU69*Max_sunhours_alt","v":2.1213076003621993},{"$f":"Rawdata!CV69*Max_sunhours_alt","v":5.2577752508972484},{"$f":"Var_a*EXP(Var_b*'Wine production Alt'!B72+Var_c)","v":2879321.4395245984},3455,6910,1229.8005065853829,33139.800506585379,34550,1410.1994934146205,11]
[70,{"$f":"SUM(Rawdata!A70:CL70)*Max_sunhours_alt","v":685.8924848101841},{"$f":"Rawdata!CM70*Max_sunhours_alt","v":10.485287039360278},{"$f":"Rawdata!CN70*Max_sunhours_alt","v":9.2104581622029364},{"$f":"Rawdata!CO70*Max_sunhours_alt","v":7.1796450068562194},{"$f":"Rawdata!CP70*Max_sunhours_alt","v":8.0160298140553987},{"$f":"Rawdata!CQ70*Max_sunhours_alt","v":10.074921381339198},{"$f":"Rawdata!CR70*Max_sunhours_alt","v":5.5665320153132587},{"$f":"Rawdata!CS70*Max_sunhours_alt","v":1.6116225884702906},{"$f":"Rawdata!CT70*Max_sunhours_alt","v":1.3582596212074542},{"$f":"Rawdata!CU70*Max_sunhours_alt","v":4.61172974706977},{"$f":"Rawdata!CV70*Max_sunhours_alt","v":11.062912783087901},{"$f":"Var_a*EXP(Var_b*'Wine production Alt'!B73+Var_c)","v":4343364.2993180249},5212,10424,1134.9609180045711,36558.960918004574,52120,15561.039081995426,59]
[71,{"$f":"SUM(Rawdata!A71:CL71)*Max_sunhours_alt","v":619.61933404817569},{"$f":"Rawdata!CM71*Max_sunhours_alt","v":9.5952284301614679},{"$f":"Rawdata!CN71*Max_sunhours_alt","v":12.012490688263314},{"$f":"Rawdata!CO71*Max_sunhours_alt","v":4.7437300142528533},{"$f":"Rawdata!CP71*Max_sunhours_alt","v":1.9589429444222035},{"$f":"Rawdata!CQ71*Max_sunhours_alt","v":14.302349769993439},{"$f":"Rawdata!CR71*Max_sunhours_alt","v":4.8863290808950408},{"$f":"Rawdata!CS71*Max_sunhours_alt","v":12.410684114270351},{"$f":"Rawdata!CT71*Max_sunhours_alt","v":14.473885662121269},{"$f":"Rawdata!CU71*Max_sunhours_alt","v":11.253321647048406},{"$f":"Rawdata!CV71*Max_sunhours_alt","v":3.0902353180231632},{"$f":"Var_a*EXP(Var_b*'Wine production Alt'!B74+Var_c)","v":3036708.5585870272},3644,7288,2904.7960311858246,35192.796031185826,36440,1247.203968814174,10]
[72,{"$f":"SUM(Rawdata!A72:CL72)*Max_sunhours_alt","v":682.03385302235381},{"$f":"Rawdata!CM72*Max_sunhours_alt","v":1.3234099047951808E-2},{"$f":"Rawdata!CN72*Max_sunhours_alt","v":12.443282194563457},{"$f":"Rawdata!CO72*Max_sunhours_alt","v":7.6662246868716331},{"$f":"Rawdata!CP72*Max_sunhours_alt","v":4.9352181280364142},{"$f":"Rawdata!CQ72*Max_sunhours_alt","v":6.6147402549622907},{"$f":"Rawdata!CR72*Max_sunhours_alt","v":4.332671083927389},{"$f":"Rawdata!CS72*Max_sunhours_alt","v":3.1399110584023804},{"$f":"Rawdata!CT72*Max_sunhours_alt","v":2.7003847213975982},{"$f":"Rawdata!CU72*Max_sunhours_alt","v":9.6659629103468578},{"$f":"Rawdata!CV72*Max_sunhours_alt","v":10.93581829913831},{"$f":"Var_a*EXP(Var_b*'Wine production Alt'!B75+Var_c)","v":4253799.656438929},5104,10208,1071.1288090920257,36279.128809092028,51040,14760.871190907972,58]
[73,{"$f":"SUM(Rawdata!A73:CL73)*Max_sunhours_alt","v":724.31011343327987},{"$f":"Rawdata!CM73*Max_sunhours_alt","v":9.054617606370206},{"$f":"Rawdata!CN73*Max_sunhours_alt","v":6.3499402792413981},{"$f":"Rawdata!CO73*Max_sunhours_alt","v":1.2269274180669991},{"$f":"Rawdata!CP73*Max_sunhours_alt","v":14.023454589622323},{"$f":"Rawdata!CQ73*Max_sunhours_alt","v":13.261878664805712},{"$f":"Rawdata!CR73*Max_sunhours_alt","v":1.4339568059220342},{"$f":"Rawdata!CS73*Max_sunhours_alt","v":7.4111263702121146},{"$f":"Rawdata!CT73*Max_sunhours_alt","v":2.3075660467465875},{"$f":"Rawdata!CU73*Max_sunhours_alt","v":13.96674697428962},{"$f":"Rawdata!CV73*Max_sunhours_alt","v":7.6329359603290907},{"$f":"Var_a*EXP(Var_b*'Wine production Alt'!B76+Var_c)","v":5344694.7134075491},6413,12826,2043.9633795416953,39869.963379541696,64130,24260.036620458304,89]
[74,{"$f":"SUM(Rawdata!A74:CL74)*Max_sunhours_alt","v":583.61128283055587},{"$f":"Rawdata!CM74*Max_sunhours_alt","v":9.2830271735653636},{"$f":"Rawdata!CN74*Max_sunhours_alt","v":10.240659753611187},{"$f":"Rawdata!CO74*Max_sunhours_alt","v":9.6631768758569336},{"$f":"Rawdata!CP74*Max_sunhours_alt","v":7.1988891544883469},{"$f":"Rawdata!CQ74*Max_sunhours_alt","v":1.2894645609326054},{"$f":"Rawdata!CR74*Max_sunhours_alt","v":9.1749348395837522},{"$f":"Rawdata!CS74*Max_sunhours_alt","v":13.356158334022988},{"$f":"Rawdata!CT74*Max_sunhours_alt","v":5.3656748776580816},{"$f":"Rawdata!CU74*Max_sunhours_alt","v":7.0507243641883095},{"$f":"Rawdata!CV74*Max_sunhours_alt","v":11.604274509827649},{"$f":"Var_a*EXP(Var_b*'Wine production Alt'!B77+Var_c)","v":2500100.0255578584},3000,6000,1832.2231486467865,32832.223148646786,30000,-2832.2231486467863,4]
[75,{"$f":"SUM(Rawdata!A75:CL75)*Max_sunhours_alt","v":653.60330975448096},{"$f":"Rawdata!CM75*Max_sunhours_alt","v":12.694759809903109},{"$f":"Rawdata!CN75*Max_sunhours_alt","v":14.292385703983989},{"$f":"Rawdata!CO75*Max_sunhours_alt","v":11.190843858135048},{"$f":"Rawdata!CP75*Max_sunhours_alt","v":11.025070597867707},{"$f":"Rawdata!CQ75*Max_sunhours_alt","v":12.860229949258944},{"$f":"Rawdata!CR75*Max_sunhours_alt","v":6.4273766978281435},{"$f":"Rawdata!CS75*Max_sunhours_alt","v":9.3138600332229302},{"$f":"Rawdata!CT75*Max_sunhours_alt","v":0.21558135930762223},{"$f":"Rawdata!CU75*Max_sunhours_alt","v":13.88031438869514},{"$f":"Rawdata!CV75*Max_sunhours_alt","v":2.4761220043058403},{"$f":"Var_a*EXP(Var_b*'Wine production Alt'!B78+Var_c)","v":3648396.2471199273},4378,8756,3275.7464341066861,37031.746434106688,43780,6748.253565893312,31]
[76,{"$f":"SUM(Rawdata!A76:CL76)*Max_sunhours_alt","v":742.40516333185667},{"$f":"Rawdata!CM76*Max_sunhours_alt","v":3.2146870433694903},{"$f":"Rawdata!CN76*Max_sunhours_alt","v":12.234432356134928},{"$f":"Rawdata!CO76*Max_sunhours_alt","v":4.0462129108021481},{"$f":"Rawdata!CP76*Max_sunhours_alt","v":10.515324821457913},{"$f":"Rawdata!CQ76*Max_sunhours_alt","v":6.8898558175782822},{"$f":"Rawdata!CR76*Max_sunhours_alt","v":10.879005170507256},{"$f":"Rawdata!CS76*Max_sunhours_alt","v":1.7076160370873255},{"$f":"Rawdata!CT76*Max_sunhours_alt","v":9.3971595342594689},{"$f":"Rawdata!CU76*Max_sunhours_alt","v":13.691887383554967},{"$f":"Rawdata!CV76*Max_sunhours_alt","v":3.7416809767106036},{"$f":"Var_a*EXP(Var_b*'Wine production Alt'!B79+Var_c)","v":5893309.3325614845},7071,14142,1921.7809265914539,41063.780926591455,70710,29646.219073408545,95]
[77,{"$f":"SUM(Rawdata!A77:CL77)*Max_sunhours_alt","v":612.6365023978052},{"$f":"Rawdata!CM77*Max_sunhours_alt","v":0.40782604411043699},{"$f":"Rawdata!CN77*Max_sunhours_alt","v":1.6970682043423184},{"$f":"Rawdata!CO77*Max_sunhours_alt","v":2.8864591581463079},{"$f":"Rawdata!CP77*Max_sunhours_alt","v":0.29323078851516637},{"$f":"Rawdata!CQ77*Max_sunhours_alt","v":14.063715168310774},{"$f":"Rawdata!CR77*Max_sunhours_alt","v":12.139659372083555},{"$f":"Rawdata!CS77*Max_sunhours_alt","v":12.606900103190924},{"$f":"Rawdata!CT77*Max_sunhours_alt","v":11.518577933410381},{"$f":"Rawdata!CU77*Max_sunhours_alt","v":10.864110685268928},{"$f":"Rawdata!CV77*Max_sunhours_alt","v":0.30481467332862222},{"$f":"Var_a*EXP(Var_b*'Wine production Alt'!B80+Var_c)","v":2924334.4810815183},3509,7018,2369.2963262264557,34387.296326226453,35090,702.70367377354705,9]
[78,{"$f":"SUM(Rawdata!A78:CL78)*Max_sunhours_alt","v":723.17475957699639},{"$f":"Rawdata!CM78*Max_sunhours_alt","v":13.416918976524181},{"$f":"Rawdata!CN78*Max_sunhours_alt","v":1.4592393889980189},{"$f":"Rawdata!CO78*Max_sunhours_alt","v":0.5275202244427557},{"$f":"Rawdata!CP78*Max_sunhours_alt","v":9.5854383395049521},{"$f":"Rawdata!CQ78*Max_sunhours_alt","v":10.460251681262106},{"$f":"Rawdata!CR78*Max_sunhours_alt","v":12.085760812258073},{"$f":"Rawdata!CS78*Max_sunhours_alt","v":14.362004890378309},{"$f":"Rawdata!CT78*Max_sunhours_alt","v":5.3850396836286878},{"$f":"Rawdata!CU78*Max_sunhours_alt","v":1.0307732360107087},{"$f":"Rawdata!CV78*Max_sunhours_alt","v":9.4183070788454515},{"$f":"Var_a*EXP(Var_b*'Wine production Alt'!B81+Var_c)","v":5312027.1101456704},6374,12748,2432.8681778773075,40180.86817787731,63740,23559.13182212269,87]
[79,{"$f":"SUM(Rawdata!A79:CL79)*Max_sunhours_alt","v":693.85774813560624},{"$f":"Rawdata!CM79*Max_sunhours_alt","v":10.229359915774422},{"$f":"Rawdata!CN79*Max_sunhours_alt","v":11.159501524510947},{"$f":"Rawdata!CO79*Max_sunhours_alt","v":5.1726658774463221},{"$f":"Rawdata!CP79*Max_sunhours_alt","v":2.3044133926139581},{"$f":"Rawdata!CQ79*Max_sunhours_alt","v":6.7452038365822728},{"$f":"Rawdata!CR79*Max_sunhours_alt","v":5.4584748296169234},{"$f":"Rawdata!CS79*Max_sunhours_alt","v":7.0738033988736779},{"$f":"Rawdata!CT79*Max_sunhours_alt","v":9.1586579759909998},{"$f":"Rawdata!CU79*Max_sunhours_alt","v":12.114838696136809},{"$f":"Rawdata!CV79*Max_sunhours_alt","v":9.2427310431182832},{"$f":"Var_a*EXP(Var_b*'Wine production Alt'!B82+Var_c)","v":4534258.907219978},5441,10882,1440.5089155531457,37322.508915553146,54410,17087.491084446854,67]
[80,{"$f":"SUM(Rawdata!A80:CL80)*Max_sunhours_alt","v":694.45363869270375},{"$f":"Rawdata!CM80*Max_sunhours_alt","v":8.5266752174942493},{"$f":"Rawdata!CN80*Max_sunhours_alt","v":14.959951190802707},{"$f":"Rawdata!CO80*Max_sunhours_alt","v":8.7648144895291225},{"$f":"Rawdata!CP80*Max_sunhours_alt","v":4.6566332566868223},{"$f":"Rawdata!CQ80*Max_sunhours_alt","v":2.6750933660364238},{"$f":"Rawdata!CR80*Max_sunhours_alt","v":0.96642104885730662},{"$f":"Rawdata!CS80*Max_sunhours_alt","v":7.5498331403012111},{"$f":"Rawdata!CT80*Max_sunhours_alt","v":13.085873643172611},{"$f":"Rawdata!CU80*Max_sunhours_alt","v":10.583790074800746},{"$f":"Rawdata!CV80*Max_sunhours_alt","v":10.090500771174563},{"$f":"Var_a*EXP(Var_b*'Wine production Alt'!B83+Var_c)","v":4548872.7861035746},5458,10916,2106.1438527275213,38022.143852727517,54580,16557.856147272483,65]
[81,{"$f":"SUM(Rawdata!A81:CL81)*Max_sunhours_alt","v":720.81470461167169},{"$f":"Rawdata!CM81*Max_sunhours_alt","v":9.2862743896950466},{"$f":"Rawdata!CN81*Max_sunhours_alt","v":6.5577096054208726},{"$f":"Rawdata!CO81*Max_sunhours_alt","v":6.5709974640990598E-2},{"$f":"Rawdata!CP81*Max_sunhours_alt","v":13.226743878741424},{"$f":"Rawdata!CQ81*Max_sunhours_alt","v":9.4646305717063548},{"$f":"Rawdata!CR81*Max_sunhours_alt","v":4.2466972062266608},{"$f":"Rawdata!CS81*Max_sunhours_alt","v":3.5438516528804342},{"$f":"Rawdata!CT81*Max_sunhours_alt","v":2.2799546187475577},{"$f":"Rawdata!CU81*Max_sunhours_alt","v":1.0531997741642267},{"$f":"Rawdata!CV81*Max_sunhours_alt","v":11.764884376121794},{"$f":"Var_a*EXP(Var_b*'Wine production Alt'!B84+Var_c)","v":5244758.6152693704},6293,12586,1374.2533216264619,38960.253321626464,62930,23969.746678373536,88]
[82,{"$f":"SUM(Rawdata!A82:CL82)*Max_sunhours_alt","v":697.26891557387705},{"$f":"Rawdata!CM82*Max_sunhours_alt","v":7.5737587693057966},{"$f":"Rawdata!CN82*Max_sunhours_alt","v":14.294840967086843},{"$f":"Rawdata!CO82*Max_sunhours_alt","v":11.574889644237825},{"$f":"Rawdata!CP82*Max_sunhours_alt","v":1.2017043495355573},{"$f":"Rawdata!CQ82*Max_sunhours_alt","v":10.433123305841191},{"$f":"Rawdata!CR82*Max_sunhours_alt","v":1.2110232715208551},{"$f":"Rawdata!CS82*Max_sunhours_alt","v":0.82987146047322935},{"$f":"Rawdata!CT82*Max_sunhours_alt","v":6.8489319020337325},{"$f":"Rawdata!CU82*Max_sunhours_alt","v":9.9230537352864445},{"$f":"Rawdata!CV82*Max_sunhours_alt","v":13.128436739882615},{"$f":"Var_a*EXP(Var_b*'Wine production Alt'!B85+Var_c)","v":4618555.3348585619},5542,11084,2192.810316164072,38276.810316164076,55420,17143.189683835924,68]
[83,{"$f":"SUM(Rawdata!A83:CL83)*Max_sunhours_alt","v":599.95803332157811},{"$f":"Rawdata!CM83*Max_sunhours_alt","v":6.0633232049131829},{"$f":"Rawdata!CN83*Max_sunhours_alt","v":6.0765691053069535},{"$f":"Rawdata!CO83*Max_sunhours_alt","v":13.466619041091379},{"$f":"Rawdata!CP83*Max_sunhours_alt","v":1.746996279191408},{"$f":"Rawdata!CQ83*Max_sunhours_alt","v":2.1378884827050242},{"$f":"Rawdata!CR83*Max_sunhours_alt","v":5.4307612449526292},{"$f":"Rawdata!CS83*Max_sunhours_alt","v":14.77403606874744},{"$f":"Rawdata!CT83*Max_sunhours_alt","v":11.336741174525878},{"$f":"Rawdata!CU83*Max_sunhours_alt","v":8.0074353790963784},{"$f":"Rawdata!CV83*Max_sunhours_alt","v":7.9967252328684477},{"$f":"Var_a*EXP(Var_b*'Wine production Alt'!B86+Var_c)","v":2730823.4505355856},3276,6552,1808.1556896329521,33360.155689632957,32760,-600.15568963295664,6]
[84,{"$f":"SUM(Rawdata!A84:CL84)*Max_sunhours_alt","v":700.47979050831646},{"$f":"Rawdata!CM84*Max_sunhours_alt","v":13.595667332438795},{"$f":"Rawdata!CN84*Max_sunhours_alt","v":10.403892989357201},{"$f":"Rawdata!CO84*Max_sunhours_alt","v":0.93334880980270873},{"$f":"Rawdata!CP84*Max_sunhours_alt","v":7.3758375743102453},{"$f":"Rawdata!CQ84*Max_sunhours_alt","v":5.690118870470446},{"$f":"Rawdata!CR84*Max_sunhours_alt","v":1.2817531907975614},{"$f":"Rawdata!CS84*Max_sunhours_alt","v":2.2116094816769039},{"$f":"Rawdata!CT84*Max_sunhours_alt","v":13.571569973429876},{"$f":"Rawdata!CU84*Max_sunhours_alt","v":12.338155908748679},{"$f":"Rawdata!CV84*Max_sunhours_alt","v":13.474124698856919},{"$f":"Var_a*EXP(Var_b*'Wine production Alt'!B87+Var_c)","v":4699333.4652588638},5639,11278,2588.3410902831465,38866.341090283146,56390,17523.658909716854,71]
[85,{"$f":"SUM(Rawdata!A85:CL85)*Max_sunhours_alt","v":718.84388560127081},{"$f":"Rawdata!CM85*Max_sunhours_alt","v":3.3957610281406279},{"$f":"Rawdata!CN85*Max_sunhours_alt","v":8.0342533802803082},{"$f":"Rawdata!CO85*Max_sunhours_alt","v":12.06075376742062},{"$f":"Rawdata!CP85*Max_sunhours_alt","v":8.875203534993366},{"$f":"Rawdata!CQ85*Max_sunhours_alt","v":1.3458676558792209},{"$f":"Rawdata!CR85*Max_sunhours_alt","v":9.3342524560152551},{"$f":"Rawdata!CS85*Max_sunhours_alt","v":5.415515981813436},{"$f":"Rawdata!CT85*Max_sunhours_alt","v":0.21780096642385394},{"$f":"Rawdata!CU85*Max_sunhours_alt","v":2.5020091286879795},{"$f":"Rawdata!CV85*Max_sunhours_alt","v":14.083405135415045},{"$f":"Var_a*EXP(Var_b*'Wine production Alt'!B88+Var_c)","v":5189237.640227302},6227,12454,1488.7868274124598,38942.786827412463,62270,23327.213172587537,86]
[86,{"$f":"SUM(Rawdata!A86:CL86)*Max_sunhours_alt","v":717.29376720041842},{"$f":"Rawdata!CM86*Max_sunhours_alt","v":2.2870355946321612},{"$f":"Rawdata!CN86*Max_sunhours_alt","v":4.565046233687247},{"$f":"Rawdata!CO86*Max_sunhours_alt","v":1.4246920488057246},{"$f":"Rawdata!CP86*Max_sunhours_alt","v":14.932114980740131},{"$f":"Rawdata!CQ86*Max_sunhours_alt","v":4.0608991330786708},{"$f":"Rawdata!CR86*Max_sunhours_alt","v":1.292472241772173},{"$f":"Rawdata!CS86*Max_sunhours_alt","v":1.3601542403231404},{"$f":"Rawdata!CT86*Max_sunhours_alt","v":5.6341302826392772},{"$f":"Rawdata!CU86*Max_sunhours_alt","v":13.245340185554234},{"$f":"Rawdata!CV86*Max_sunhours_alt","v":3.0343795068597816},{"$f":"Var_a*EXP(Var_b*'Wine production Alt'!B89+Var_c)","v":5145981.695888686},6175,12350,1317.7455166294365,38667.745516629438,61750,23082.254483370562,85]
[87,{"$f":"SUM(Rawdata!A87:CL87)*Max_sunhours_alt","v":635.862269327435},{"$f":"Rawdata!CM87*Max_sunhours_alt","v":2.5212188977313281},{"$f":"Rawdata!CN87*Max_sunhours_alt","v":1.6752337365754266},{"$f":"Rawdata!CO87*Max_sunhours_alt","v":6.2210850854080233},{"$f":"Rawdata!CP87*Max_sunhours_alt","v":11.59172746319506},{"$f":"Rawdata!CQ87*Max_sunhours_alt","v":6.6129930411083331},{"$f":"Rawdata!CR87*Max_sunhours_alt","v":3.1495548917469858},{"$f":"Rawdata!CS87*Max_sunhours_alt","v":0.24275630151899819},{"$f":"Rawdata!CT87*Max_sunhours_alt","v":2.5332433646254557},{"$f":"Rawdata!CU87*Max_sunhours_alt","v":14.659011547482166},{"$f":"Rawdata!CV87*Max_sunhours_alt","v":13.475643215450393},{"$f":"Var_a*EXP(Var_b*'Wine production Alt'!B90+Var_c)","v":3315094.2956616022},3978,7956,1722.6382226127616,34678.638222612761,39780,5101.3617773872393,26]
[88,{"$f":"SUM(Rawdata!A88:CL88)*Max_sunhours_alt","v":668.40848905466635},{"$f":"Rawdata!CM88*Max_sunhours_alt","v":14.788109011796053},{"$f":"Rawdata!CN88*Max_sunhours_alt","v":11.333256433060827},{"$f":"Rawdata!CO88*Max_sunhours_alt","v":9.9548757430645196},{"$f":"Rawdata!CP88*Max_sunhours_alt","v":2.0556720192424938},{"$f":"Rawdata!CQ88*Max_sunhours_alt","v":6.1808503205994718},{"$f":"Rawdata!CR88*Max_sunhours_alt","v":4.5949127146564939},{"$f":"Rawdata!CS88*Max_sunhours_alt","v":1.5207405287967539},{"$f":"Rawdata!CT88*Max_sunhours_alt","v":3.178119433629869},{"$f":"Rawdata!CU88*Max_sunhours_alt","v":1.7174425340533945},{"$f":"Rawdata!CV88*Max_sunhours_alt","v":4.7446866754481514},{"$f":"Var_a*EXP(Var_b*'Wine production Alt'!B91+Var_c)","v":3952054.8344653263},4742,9484,1357.6241187921396,35841.624118792141,47420,11578.375881207859,46]
[89,{"$f":"SUM(Rawdata!A89:CL89)*Max_sunhours_alt","v":758.68656987615384},{"$f":"Rawdata!CM89*Max_sunhours_alt","v":2.8090838398296141},{"$f":"Rawdata!CN89*Max_sunhours_alt","v":5.6427079255822745},{"$f":"Rawdata!CO89*Max_sunhours_alt","v":10.253893534074777},{"$f":"Rawdata!CP89*Max_sunhours_alt","v":5.872351754773443},{"$f":"Rawdata!CQ89*Max_sunhours_alt","v":5.2281053332279557},{"$f":"Rawdata!CR89*Max_sunhours_alt","v":12.068556286820625},{"$f":"Rawdata!CS89*Max_sunhours_alt","v":9.6496608053212114},{"$f":"Rawdata!CT89*Max_sunhours_alt","v":13.988354203308223},{"$f":"Rawdata!CU89*Max_sunhours_alt","v":7.5487682709558479},{"$f":"Rawdata!CV89*Max_sunhours_alt","v":14.864404974287465},{"$f":"Var_a*EXP(Var_b*'Wine production Alt'!B92+Var_c)","v":6434906.3733297689},7721,15442,2337.3638074768151,42779.363807476817,77210,34430.636192523183,98]
[90,{"$f":"SUM(Rawdata!A90:CL90)*Max_sunhours_alt","v":631.43445032379577},{"$f":"Rawdata!CM90*Max_sunhours_alt","v":2.981461917715742},{"$f":"Rawdata!CN90*Max_sunhours_alt","v":4.8126875464973704},{"$f":"Rawdata!CO90*Max_sunhours_alt","v":5.9761340876670177},{"$f":"Rawdata!CP90*Max_sunhours_alt","v":14.972884041435245},{"$f":"Rawdata!CQ90*Max_sunhours_alt","v":5.3275161854517501},{"$f":"Rawdata!CR90*Max_sunhours_alt","v":14.919612683556201},{"$f":"Rawdata!CS90*Max_sunhours_alt","v":8.8712420145658637},{"$f":"Rawdata!CT90*Max_sunhours_alt","v":3.4738100020223377},{"$f":"Rawdata!CU90*Max_sunhours_alt","v":11.786092302899551},{"$f":"Rawdata!CV90*Max_sunhours_alt","v":7.2682591659992006},{"$f":"Var_a*EXP(Var_b*'Wine production Alt'!B93+Var_c)","v":3236769.7630207404},3884,7768,2054.9831042456858,34822.983104245686,38840,4017.0168957543137,20]
[91,{"$f":"SUM(Rawdata!A91:CL91)*Max_sunhours_alt","v":710.54322508147823},{"$f":"Rawdata!CM91*Max_sunhours_alt","v":1.4813006957462878},{"$f":"Rawdata!CN91*Max_sunhours_alt","v":8.6729306446400596},{"$f":"Rawdata!CO91*Max_sunhours_alt","v":6.0349658759209674},{"$f":"Rawdata!CP91*Max_sunhours_alt","v":4.9679072745387716},{"$f":"Rawdata!CQ91*Max_sunhours_alt","v":11.395325559284542},{"$f":"Rawdata!CR91*Max_sunhours_alt","v":13.428636698479254},{"$f":"Rawdata!CS91*Max_sunhours_alt","v":1.801671882094547},{"$f":"Rawdata!CT91*Max_sunhours_alt","v":2.3831919932449197},{"$f":"Rawdata!CU91*Max_sunhours_alt","v":10.902683765355144},{"$f":"Rawdata!CV91*Max_sunhours_alt","v":13.503119906368608},{"$f":"Var_a*EXP(Var_b*'Wine production Alt'!B94+Var_c)","v":4961773.4610039322},5954,11908,2040.2696574127613,38948.269657412762,59540,20591.730342587238,79]
[92,{"$f":"SUM(Rawdata!A92:CL92)*Max_sunhours_alt","v":676.56782913703387},{"$f":"Rawdata!CM92*Max_sunhours_alt","v":4.3493355943867593},{"$f":"Rawdata!CN92*Max_sunhours_alt","v":1.7400581515067515},{"$f":"Rawdata!CO92*Max_sunhours_alt","v":6.8755344956828939},{"$f":"Rawdata!CP92*Max_sunhours_alt","v":9.3326855434424818},{"$f":"Rawdata!CQ92*Max_sunhours_alt","v":2.6276266719355146},{"$f":"Rawdata!CR92*Max_sunhours_alt","v":12.345545782966646},{"$f":"Rawdata!CS92*Max_sunhours_alt","v":5.3173092930517178},{"$f":"Rawdata!CT92*Max_sunhours_alt","v":0.83264316168274011},{"$f":"Rawdata!CU92*Max_sunhours_alt","v":14.423467775447186},{"$f":"Rawdata!CV92*Max_sunhours_alt","v":2.1280917835828128},{"$f":"Var_a*EXP(Var_b*'Wine production Alt'!B95+Var_c)","v":4130077.1672059726},4956,9912,1360.1699101856311,36272.169910185636,49560,13287.830089814364,52]
[93,{"$f":"SUM(Rawdata!A93:CL93)*Max_sunhours_alt","v":684.6513829577159},{"$f":"Rawdata!CM93*Max_sunhours_alt","v":2.3428857743110028},{"$f":"Rawdata!CN93*Max_sunhours_alt","v":1.3811039291428178},{"$f":"Rawdata!CO93*Max_sunhours_alt","v":8.0069890503904464},{"$f":"Rawdata!CP93*Max_sunhours_alt","v":4.5831016328198082},{"$f":"Rawdata!CQ93*Max_sunhours_alt","v":5.4285110434963357},{"$f":"Rawdata!CR93*Max_sunhours_alt","v":5.9160392076478896},{"$f":"Rawdata!CS93*Max_sunhours_alt","v":2.6710750466368074},{"$f":"Rawdata!CT93*Max_sunhours_alt","v":9.8323756242548583},{"$f":"Rawdata!CU93*Max_sunhours_alt","v":6.7265958415570575},{"$f":"Rawdata!CV93*Max_sunhours_alt","v":6.2757837984688818},{"$f":"Var_a*EXP(Var_b*'Wine production Alt'!B96+Var_c)","v":4314352.6149577796},5177,10354,283.93646746453032,35637.936467464533,51770,16132.063532535467,64]
[94,{"$f":"SUM(Rawdata!A94:CL94)*Max_sunhours_alt","v":673.34922266164642},{"$f":"Rawdata!CM94*Max_sunhours_alt","v":4.4600500456135581},{"$f":"Rawdata!CN94*Max_sunhours_alt","v":5.6116984126875913},{"$f":"Rawdata!CO94*Max_sunhours_alt","v":7.0358087998328775},{"$f":"Rawdata!CP94*Max_sunhours_alt","v":13.909575835445072},{"$f":"Rawdata!CQ94*Max_sunhours_alt","v":14.351038181734891},{"$f":"Rawdata!CR94*Max_sunhours_alt","v":9.8298592458846041},{"$f":"Rawdata!CS94*Max_sunhours_alt","v":2.3996404547605774},{"$f":"Rawdata!CT94*Max_sunhours_alt","v":7.7949275014207329},{"$f":"Rawdata!CU94*Max_sunhours_alt","v":10.847570498616923},{"$f":"Rawdata!CV94*Max_sunhours_alt","v":14.929798591111792},{"$f":"Var_a*EXP(Var_b*'Wine production Alt'!B97+Var_c)","v":4058914.6747421422},4870,9740,2666.2769854214021,37406.276985421398,48700,11293.723014578602,45]
[95,{"$f":"SUM(Rawdata!A95:CL95)*Max_sunhours_alt","v":652.67855625477398},{"$f":"Rawdata!CM95*Max_sunhours_alt","v":10.831109988520893},{"$f":"Rawdata!CN95*Max_sunhours_alt","v":4.0396891479075281},{"$f":"Rawdata!CO95*Max_sunhours_alt","v":14.741754700701112},{"$f":"Rawdata!CP95*Max_sunhours_alt","v":8.3515204815754167},{"$f":"Rawdata!CQ95*Max_sunhours_alt","v":5.8287623741770656E-3},{"$f":"Rawdata!CR95*Max_sunhours_alt","v":12.607134879446635},{"$f":"Rawdata!CS95*Max_sunhours_alt","v":0.62535977126850439},{"$f":"Rawdata!CT95*Max_sunhours_alt","v":0.55725068695510804},{"$f":"Rawdata!CU95*Max_sunhours_alt","v":5.0495908054434997},{"$f":"Rawdata!CV95*Max_sunhours_alt","v":7.854995179612617},{"$f":"Var_a*EXP(Var_b*'Wine production Alt'!B98+Var_c)","v":3630222.7781604948},4356,8712,1688.651522985667,35400.651522985667,43560,8159.3484770143332,36]
[96,{"$f":"SUM(Rawdata!A96:CL96)*Max_sunhours_alt","v":627.1061188063012},{"$f":"Rawdata!CM96*Max_sunhours_alt","v":11.227123438742165},{"$f":"Rawdata!CN96*Max_sunhours_alt","v":13.38331747282635},{"$f":"Rawdata!CO96*Max_sunhours_alt","v":12.920288177925835},{"$f":"Rawdata!CP96*Max_sunhours_alt","v":8.534758555944606},{"$f":"Rawdata!CQ96*Max_sunhours_alt","v":6.6098733977182196},{"$f":"Rawdata!CR96*Max_sunhours_alt","v":2.7630691750235696},{"$f":"Rawdata!CS96*Max_sunhours_alt","v":12.038329118719217},{"$f":"Rawdata!CT96*Max_sunhours_alt","v":9.1561620973474582},{"$f":"Rawdata!CU96*Max_sunhours_alt","v":4.8946254123772999},{"$f":"Rawdata!CV96*Max_sunhours_alt","v":1.74007837005135},{"$f":"Var_a*EXP(Var_b*'Wine production Alt'!B99+Var_c)","v":3161994.0452597151},3794,7588,2225.9978861505629,34813.997886150566,37940,3126.002113849434,15]
[97,{"$f":"SUM(Rawdata!A97:CL97)*Max_sunhours_alt","v":575.95609815284888},{"$f":"Rawdata!CM97*Max_sunhours_alt","v":12.466553325190617},{"$f":"Rawdata!CN97*Max_sunhours_alt","v":4.4571700459287298},{"$f":"Rawdata!CO97*Max_sunhours_alt","v":11.858521323890317},{"$f":"Rawdata!CP97*Max_sunhours_alt","v":7.948100900176466},{"$f":"Rawdata!CQ97*Max_sunhours_alt","v":2.9544696162621853},{"$f":"Rawdata!CR97*Max_sunhours_alt","v":12.106064385488168},{"$f":"Rawdata!CS97*Max_sunhours_alt","v":5.6020577076311175},{"$f":"Rawdata!CT97*Max_sunhours_alt","v":13.21554205297295},{"$f":"Rawdata!CU97*Max_sunhours_alt","v":8.8292564205232722},{"$f":"Rawdata!CV97*Max_sunhours_alt","v":12.63782927494584},{"$f":"Var_a*EXP(Var_b*'Wine production Alt'!B100+Var_c)","v":2398857.8878805758},{"$f":"ROUNDDOWN(M100*(1-Spoilage)/Grapes_per_bottle,0)","v":2878},{"$f":"N100*Prodcosts_per_bottle","v":5756},2656.1867683187629,{"$f":"O100+P100+Vineyard_cost_alt","v":33412.186768318759},28780,-4632.1867683187593,1]
[98,{"$f":"SUM(Rawdata!A98:CL98)*Max_sunhours_alt","v":676.93809721934826},{"$f":"Rawdata!CM98*Max_sunhours_alt","v":11.458723859511725},{"$f":"Rawdata!CN98*Max_sunhours_alt","v":2.9970476073081818},{"$f":"Rawdata!CO98*Max_sunhours_alt","v":13.773716793182938},{"$f":"Rawdata!CP98*Max_sunhours_alt","v":7.4206307323399257},{"$f":"Rawdata!CQ98*Max_sunhours_alt","v":11.98006028689171},{"$f":"Rawdata!CR98*Max_sunhours_alt","v":2.6677042060292488},{"$f":"Rawdata!CS98*Max_sunhours_alt","v":8.8107708554220832},{"$f":"Rawdata!CT98*Max_sunhours_alt","v":0.40497023192977988},{"$f":"Rawdata!CU98*Max_sunhours_alt","v":5.1559996210294736},{"$f":"Rawdata!CV98*Max_sunhours_alt","v":12.447505635807275},{"$f":"Var_a*EXP(Var_b*'Wine production Alt'!B101+Var_c)","v":4138343.3013669201},{"$f":"ROUNDDOWN(M101*(1-Spoilage)/Grapes_per_bottle,0)","v":4966},{"$f":"N101*Prodcosts_per_bottle","v":9932},2097.0777430815733,{"$f":"O101+P101+Vineyard_cost_alt","v":37029.077743081572},49660,12630.922256918428,47]
[99,{"$f":"SUM(Rawdata!A99:CL99)*Max_sunhours_alt","v":676.35740746412682},{"$f":"Rawdata!CM99*Max_sunhours_alt","v":5.7314761246387222},{"$f":"Rawdata!CN99*Max_sunhours_alt","v":2.331281763086186},{"$f":"Rawdata!CO99*Max_sunhours_alt","v":4.2975052221957792},{"$f":"Rawdata!CP99*Max_sunhours_alt","v":13.598240535739953},{"$f":"Rawdata!CQ99*Max_sunhours_alt","v":7.4195966282280859},{"$f":"Rawdata!CR99*Max_sunhours_alt","v":10.651231224157666},{"$f":"Rawdata!CS99*Max_sunhours_alt","v":4.1634714165813724},{"$f":"Rawdata!CT99*Max_sunhours_alt","v":2.2613024056950075},{"$f":"Rawdata!CU99*Max_sunhours_alt","v":0.55121767439595737},{"$f":"Rawdata!CV99*Max_sunhours_alt","v":10.059277949076309},{"$f":"Var_a*EXP(Var_b*'Wine production Alt'!B102+Var_c)","v":4125386.9205878749},{"$f":"ROUNDDOWN(M102*(1-Spoilage)/Grapes_per_bottle,0)","v":4950},{"$f":"N102*Prodcosts_per_bottle","v":9900},1180.8749708973928,{"$f":"O102+P102+Vineyard_cost_alt","v":36080.874970897392},49500,13419.125029102608,54]
[100,{"$f":"SUM(Rawdata!A100:CL100)*Max_sunhours_alt","v":684.81324371125766},{"$f":"Rawdata!CM100*Max_sunhours_alt","v":6.7838632701657806},{"$f":"Rawdata!CN100*Max_sunhours_alt","v":4.2665559009684353},{"$f":"Rawdata!CO100*Max_sunhours_alt","v":7.4474065752570677},{"$f":"Rawdata!CP100*Max_sunhours_alt","v":3.5670931660877598},{"$f":"Rawdata!CQ100*Max_sunhours_alt","v":9.9846136765071485},{"$f":"Rawdata!CR100*Max_sunhours_alt","v":7.4866508112386603},{"$f":"Rawdata!CS100*Max_sunhours_alt","v":0.63248806752461917},{"$f":"Rawdata!CT100*Max_sunhours_alt","v":9.8326690346714152},{"$f":"Rawdata!CU100*Max_sunhours_alt","v":0.28016454737884},{"$f":"Rawdata!CV100*Max_sunhours_alt","v":7.754108384543084},{"$f":"Var_a*EXP(Var_b*'Wine production Alt'!B103+Var_c)","v":4318125.2150071263},{"$f":"ROUNDDOWN(M103*(1-Spoilage)/Grapes_per_bottle,0)","v":5181},{"$f":"N103*Prodcosts_per_bottle","v":10362},507.13910957216478,{"$f":"O103+P103+Vineyard_cost_alt","v":35869.139109572163},51810,15940.860890427837,61]
[]
["Total",{"$f":"SUM(B4:B103)","v":67299.664178003324}]
["Expected",{"$f":"Rawdata!CY6*Rawdata!CY2*Max_sunhours_base","v":59805.795797680206}]
["Check",{"$f":"IF(TRUNC(B105)=TRUNC(B106),\"OK\",\"CHECK\")","v":"CHECK"}]

{"sheet":"Results","index":6,"n_rows":24,"n_cols":6,"rows_kept":24,"cut":false,"hidden":false,"merged":[]}
["Summary of results"]
[]
["Statistics for both scenarios"]
[]
[null,null,null,"Base","Alternative"]
[]
["Average expected profit",null,null,{"$f":"'Wine production'!M5","v":6481.84},{"$f":"'Wine production Alt'!X5","v":13133.016969142724}]
["Maximum profit",null,null,{"$f":"'Wine production'!M6","v":23288},{"$f":"'Wine production Alt'!X6","v":40640.869290191215}]
["Maximum loss",null,null,{"$f":"'Wine production'!M7","v":-3096},{"$f":"'Wine production Alt'!X7","v":-4632.1867683187593}]
["Probability of making a loss",null,null,{"$f":"'Wine production'!M8","v":0.12},{"$f":"'Wine production Alt'!X8","v":7.0000000000000007E-2}]
[]
[]
[]
[]
[]
[]
[]
["Components of expected profit for median simulation"]
[null,null,null,"Base Scenario","Alt Scenario","Change"]
["Variable costs",null,null,{"$f":"'Wine production'!M17","v":6338},{"$f":"'Wine production Alt'!X17","v":11949.953017925542},{"$f":"E20/D20","v":1.8854454114745254}]
["Fixed costs",null,null,{"$f":"'Wine production'!M18","v":20000},{"$f":"'Wine production Alt'!X18","v":25000},{"$f":"E21/D21","v":1.25}]
["Total costs",null,null,{"$f":"'Wine production'!M19","v":26338},{"$f":"'Wine production Alt'!X19","v":36949.953017925538},{"$f":"E22/D22","v":1.4029141551342372}]
["Total Revenue",null,null,{"$f":"'Wine production'!M20","v":31690},{"$f":"'Wine production Alt'!X20","v":49980},{"$f":"E23/D23","v":1.577153676238561}]
["Profit/(loss)",null,null,{"$f":"'Wine production'!M21","v":5352},{"$f":"'Wine production Alt'!X21","v":13030.046982074462},{"$f":"E24/D24","v":2.4346126648121191}]